{"text_format":"1","workbook":"xlsx","n_sheets":5,"sheets":["Countries and Currencies","Instructions","FTE Overview","Submission Overview","Definition of Terms"],"not_rendered":{"charts":0,"images":1,"macros":0,"external_links":0,"defined_names":21,"comments":0,"pivot_tables":0},"unopened":[],"bounds":{"document_bytes":16777216,"sheet_cells":100000,"rows_first":2000,"rows_last":500,"rows_between":2000,"halvings":0,"cell_chars":16384,"cell_head_chars":4096},"cells_cut":0,"cells_raw":0,"read":"whole","date_system":"1900"}

{"sheet":"Countries and Currencies","index":0,"n_rows":260,"n_cols":7,"rows_kept":260,"cut":false,"hidden":true,"merged":[]}
["CountryCode","Country","Currency","Code"]
["Central","Central",null,"GBP",null,null,"GBP"]
["International","International",null,"GBP",null,null,"USD"]
["LATAM","LATAM",null,"USD",null,null,"EUR"]
["MENA","MENA",null,"USD",null,null,"AUD"]
["APAC","APAC",null,"USD",null,null,"NZD"]
["GCC","GCC",null,"USD",null,null,"HKD"]
["DACH","Germany, Austria and Switzerland",null,"EUR",null,null,"CAD"]
["Benelux","Benelux",null,"EUR",null,null,"JPY"]
["ANZ","Australia & New Zealand",null,"AUD",null,null,"AFN"]
["NZ","New Zealand","New Zealand Dollars","NZD",null,null,"ALL"]
["CK","Cook Islands","New Zealand Dollars","NZD",null,null,"DZD"]
["NU","Niue","New Zealand Dollars","NZD",null,null,"XCD"]
["PN","Pitcairn","New Zealand Dollars","NZD",null,null,"ARS"]
["TK","Tokelau","New Zealand Dollars","NZD",null,null,"AMD"]
["AU","Australia","Australian Dollars","AUD",null,null,"ANG"]
["CX","Christmas Island","Australian Dollars","AUD",null,null,"AZN"]
["CC","Cocos (Keeling) Islands","Australian Dollars","AUD",null,null,"BSD"]
["HM","Heard and Mc Donald Islands","Australian Dollars","AUD",null,null,"BHD"]
["KI","Kiribati","Australian Dollars","AUD",null,null,"BDT"]
["NR","Nauru","Australian Dollars","AUD",null,null,"BBD"]
["NF","Norfolk Island","Australian Dollars","AUD",null,null,"BYR"]
["TV","Tuvalu","Australian Dollars","AUD",null,null,"BZD"]
["AS","American Samoa","Euros","EUR",null,null,"XOF"]
["AD","Andorra","Euros","EUR",null,null,"BMD"]
["AT","Austria","Euros","EUR",null,null,"INR"]
["BE","Belgium","Euros","EUR",null,null,"BOB"]
["FI","Finland","Euros","EUR",null,null,"BWP"]
["FR","France","Euros","EUR",null,null,"NOK"]
["GF","French Guiana","Euros","EUR",null,null,"BRL"]
["TF","French Southern Territories","Euros","EUR",null,null,"BND"]
["DE","Germany","Euros","EUR",null,null,"BGN"]
["GR","Greece","Euros","EUR",null,null,"BIF"]
["GP","Guadeloupe","Euros","EUR",null,null,"KHR"]
["IE","Ireland","Euros","EUR",null,null,"XAF"]
["IT","Italy","Euros","EUR",null,null,"CVE"]
["LU","Luxembourg","Euros","EUR",null,null,"KYD"]
["MQ","Martinique","Euros","EUR",null,null,"CLP"]
["YT","Mayotte","Euros","EUR",null,null,"RMB"]
["MC","Monaco","Euros","EUR",null,null,"COP"]
{"$rows_left_out":221}
{"sheet":"Instructions","index":1,"n_rows":165,"n_cols":23,"rows_kept":165,"cut":false,"hidden":false,"merged":[[7,2,7,3],[10,2,10,3],[17,2,17,3],[8,2,8,3],[13,2,14,3]]}
[]
[]
[]
[null,null,null,null,null,null,null,null,null,null,null,null,null,null,null,null,null,null,null,null,null,null,"AED"]
[null,null,null,null,null,null,null,null,null,null,null,null,null,null,null,null,null,null,null,null,null,null,"AFN"]
[null,null,null,null,null,null,null,null,null,null,null,null,null,null,null,null,null,null,null,null,null,null,"ALL"]
[null,null,null,null,null,null,null,null,null,null,null,null,null,null,null,null,null,null,null,null,null,null,"AMD"]
[null,null,"UK",null,null,null,null,"Germany",null,null,null,null,null,null,null,null,null,null,null,null,null,null,"ANG"]
[null,null,"Please enter AGENCY",null,null,null,null,"Netherlands version 1",null,null,null,null,null,null,null,null,null,null,null,null,null,null,"AOA"]
[null,null,null,null,null,null,null,"Netherlands version 2",null,null,null,null,null,null,null,null,null,null,null,null,null,null,"ARS"]
[null,null,"Instructions",null,null,null,null,"Romania",null,null,null,null,null,null,null,null,null,null,null,null,null,null,"BHD"]
[]
[null,null,"Please ensure you have read the Instructions to the Commercial templates before completion, and referred to the outlined budget on the 'Submission Overview' tab ",null,null,null,null,null,null,null,null,null,null,null,null,null,null,null,null,null,null,null,"BMD"]
[null,null,"Please complete the FTE Overview tab, ensuring this is completed to populate the Submission Overview tab effectively and refer to the Definition of terms and Scope of Work (Appendix B3)  throughout "]
[]
[null,null,"In all worksheets:",null,null,null,null,null,null,null,null,null,null,null,null,null,null,null,null,null,null,null,"CHF"]
[null,null,"-Please read the instructions in each worksheet carefully before completion",null,null,null,null,null,null,null,null,null,null,null,null,null,null,null,null,null,null,null,"CHW"]
[null,null,"-Please complete all cells coloured in light blue",null,null,null,null,null,null,null,null,null,null,null,null,null,null,null,null,null,null,null,"CLF"]
[null,null,"-Please do not alter any of or paste over the options in the drop-down menus",null,null,null,null,null,null,null,null,null,null,null,null,null,null,null,null,null,null,null,"CLP"]
[null,null,"-Where you are asked for a number, only enter numbers. If a commercial element is free of charge, enter 0 under cost"]
[null,null,null,null,null,null,null,null,null,null,null,null,null,null,null,null,null,null,null,null,null,null,"CNY"]
[null,null,null,null,null,null,null,null,null,null,null,null,null,null,null,null,null,null,null,null,null,null,"CVE"]
[null,null,null,null,null,null,null,null,null,null,null,null,null,null,null,null,null,null,null,null,null,null,"CYP"]
[null,null,null,null,null,null,null,null,null,null,null,null,null,null,null,null,null,null,null,null,null,null,"CZK"]
[null,null,null,null,null,null,null,null,null,null,null,null,null,null,null,null,null,null,null,null,null,null,"DJF"]
[null,null,null,null,null,null,null,null,null,null,null,null,null,null,null,null,null,null,null,null,null,null,"DKK"]
[null,null,null,null,null,null,null,null,null,null,null,null,null,null,null,null,null,null,null,null,null,null,"DOP"]
[null,null,null,null,null,null,null,null,null,null,null,null,null,null,null,null,null,null,null,null,null,null,"DZD"]
[null,null,null,null,null,null,null,null,null,null,null,null,null,null,null,null,null,null,null,null,null,null,"EEK"]
[null,null,null,null,null,null,null,null,null,null,null,null,null,null,null,null,null,null,null,null,null,null,"EGP"]
[null,null,null,null,null,null,null,null,null,null,null,null,null,null,null,null,null,null,null,null,null,null,"ERN"]
[null,null,null,null,null,null,null,null,null,null,null,null,null,null,null,null,null,null,null,null,null,null,"ETB"]
[null,null,null,null,null,null,null,null,null,null,null,null,null,null,null,null,null,null,null,null,null,null,"EUR"]
[null,null,null,null,null,null,null,null,null,null,null,null,null,null,null,null,null,null,null,null,null,null,"FJD"]
[null,null,null,null,null,null,null,null,null,null,null,null,null,null,null,null,null,null,null,null,null,null,"FKP"]
[null,null,null,null,null,null,null,null,null,null,null,null,null,null,null,null,null,null,null,null,null,null,"GBP"]
[null,null,null,null,null,null,null,null,null,null,null,null,null,null,null,null,null,null,null,null,null,null,"GEL"]
[null,null,null,null,null,null,null,null,null,null,null,null,null,null,null,null,null,null,null,null,null,null,"GHS"]
[null,null,null,null,null,null,null,null,null,null,null,null,null,null,null,null,null,null,null,null,null,null,"GIP"]
[null,null,null,null,null,null,null,null,null,null,null,null,null,null,null,null,null,null,null,null,null,null,"GMD"]
{"$rows_left_out":126}
{"sheet":"FTE Overview","index":2,"n_rows":646,"n_cols":12,"rows_kept":646,"cut":false,"hidden":false,"merged":[[8,1,8,5],[9,1,9,5],[7,1,7,5],[1,1,1,11],[2,1,2,11],[3,1,3,11],[6,1,6,5],[9,10,9,11],[5,7,5,8],[5,10,5,11],[5,1,5,5],[13,1,13,5],[15,1,15,5],[12,1,12,5],[10,1,10,5],[11,1,11,5],[14,7,14,8],[15,7,15,8],[17,1,17,5],[18,1,18,5],[19,1,19,5],[14,1,14,5]]}
[]
[null,{"$f":"Instructions!C8","v":"UK"}]
[null,{"$f":"Instructions!C9","v":"Please enter AGENCY"}]
[null,"FIXED FEE FTE OVERVIEW"]
[]
[null,"You are required to complete the table below with all agency personnel providing the required fixed fee remunerated services to CCS for a 12 month period. ",null,null,null,null,null,"Overhead Factor",null,null,"Profit"]
[null,"You must complete the tables to the right with Office Locations (and associated Overhead Factors), as well as your proposed Profit Margin (including % Subject to PRF).",null,null,null,null,null,"Office Location","% Overhead Factor",null,"% Profit Margin"]
[null,"Please refer to the \"Definition of Terms\" sheet for defintions/further instruction.",null,null,null,null,null,"Office Location 1",null,null,"% Subject to PRF"]
[null,null,null,null,null,null,null,"Office Location 2"]
[null,"Please complete the Banded Direct Labour Cost column with an annual salary figure for a single 100% FTE. [Cost should be based on salary + benefits.]",null,null,null,null,null,"Office Location 3",null,null,"Total Agency Profit Cost"]
[null,"Please complete the % Time (FTE) column with the proposed number of FTEs per Deliverable and Level of Seniority. For example, 2 full time FTEs would be inputted as 200%. ",null,null,null,null,null,"Office Location 4",null,null,"Non PRF Related",{"$f":"IFERROR(L13*(100%-L8),0)","v":0}]
[null,"Where no resource is proposed against a specific Deliverable and Level of Seniority, enter 0 in the % Time (FTE) column.",null,null,null,null,null,"Office Location 5",null,null,"PRF Related",{"$f":"IFERROR(L13*L8,0)","v":0}]
[null,"It is permissible for FTE allocation against specific deliverables to be fractional, e.g. 75% FTE. However, the final FTE allocations under each scope of work must add up to at least 100%.",null,null,null,null,null,"Office Location 6",null,null,"Total",{"$f":"L21-J21","v":0}]
[null,"Office Location columns are fixed based on the information inputted within the Overhead Factor table. You must only select from the drop-down list."]
[null,"Definitions of Levels of Seniority can be found on the \"Definition of Terms\" sheet.",null,null,null,null,null,"Total Overhead Cost"]
[null,"Please refer to the \"Submission Overview\" tab to review your submission in full.",null,null,null,null,null,{"$f":"$J$21-$H$21","v":0}]
[]
[null,"The Fixed Fee FTE will be funded by the collection of a channel neutral  % on net media charged to clients using the framework agreement"]
[null,"From the amounts collected, the Agency will only retain amounts necessarily to meet its cost and proposed profit margin (subject to PRF). All other amounts are returnable to CCS and/or GCS"]
[null,"CCS, GCS and the Agency will manage the ongoing % increase or decrease annual in line with an annual review of the agency scope of work and FTE allocation"]
[null,null,null,null,null,null,null,{"$f":"SUM(H23:H1048576)","v":0},null,{"$f":"SUM(J23:J1048576)","v":0},null,{"$f":"SUM(L23:L1048576)","v":0}]
[null,"Scope of Work","Deliverable","Level of Seniority","Banded Direct Labour Cost","Office Location","% Time (FTE)","Total Direct Labour Cost","% Overhead Factor","Agency Cost","% Profit Margin","Agency Profit Cost"]
[null,"OOH Media Implementation","OOH Media Plan Document(s) ","Managing Partner",null,null,null,{"$f":"IF(ISBLANK(F23),\"Please specify office location\",E23*G23)","v":"Please specify office location"},{"$f":"IFERROR(IF(G23>0,VLOOKUP(F23,$H$8:$I$13,2,0),0),0)","v":0},{"$f":"IFERROR(H23*(1+I23),0)","v":0},{"$f":"IFERROR(IF(G23>0,$L$7,0),0)","v":0},{"$f":"IFERROR(J23/(1-K23),0)","v":0}]
[null,"OOH Media Implementation","OOH Media Plan Document(s) ","Senior Director",null,null,null,{"$f":"IF(ISBLANK(F24),\"Please specify office location\",E24*G24)","v":"Please specify office location"},{"$f":"IFERROR(IF(G24>0,VLOOKUP(F24,$H$8:$I$13,2,0),0),0)","v":0},{"$f":"IFERROR(H24*(1+I24),0)","v":0},{"$f":"IFERROR(IF(G24>0,$L$7,0),0)","v":0},{"$f":"IFERROR(J24/(1-K24),0)","v":0}]
[null,"OOH Media Implementation","OOH Media Plan Document(s) ","Director",null,null,null,"Please specify office location",0,0,0,0]
[null,"OOH Media Implementation","OOH Media Plan Document(s) ","Senior Account Manager",null,null,null,"Please specify office location",0,0,0,0]
[null,"OOH Media Implementation","OOH Media Plan Document(s) ","Account Manager",null,null,null,"Please specify office location",0,0,0,0]
[null,"OOH Media Implementation","OOH Media Plan Document(s) ","Senior Executive",null,null,null,"Please specify office location",0,0,0,0]
[null,"OOH Media Implementation","OOH Media Plan Document(s) ","Executive",null,null,null,"Please specify office location",0,0,0,0]
[null,"OOH Media Implementation","OOH Market Insight Documents(s)","Managing Partner",null,null,null,"Please specify office location",0,0,0,0]
[null,"OOH Media Implementation","OOH Market Insight Documents(s)","Senior Director",null,null,null,"Please specify office location",0,0,0,0]
[null,"OOH Media Implementation","OOH Market Insight Documents(s)","Director",null,null,null,"Please specify office location",0,0,0,0]
[null,"OOH Media Implementation","OOH Market Insight Documents(s)","Senior Account Manager",null,null,null,"Please specify office location",0,0,0,0]
[null,"OOH Media Implementation","OOH Market Insight Documents(s)","Account Manager",null,null,null,"Please specify office location",0,0,0,0]
[null,"OOH Media Implementation","OOH Market Insight Documents(s)","Senior Executive",null,null,null,"Please specify office location",0,0,0,0]
[null,"OOH Media Implementation","OOH Market Insight Documents(s)","Executive",null,null,null,"Please specify office location",0,0,0,0]
[null,"OOH Media Buying","OOH Media Buying Servies ","Managing Partner",null,null,null,"Please specify office location",0,0,0,0]
[null,"OOH Media Buying","OOH Media Buying Servies ","Senior Director",null,null,null,"Please specify office location",0,0,0,0]
[null,"OOH Media Buying","OOH Media Buying Servies ","Director",null,null,null,"Please specify office location",0,0,0,0]
[null,"OOH Media Buying","OOH Media Buying Servies ","Senior Account Manager",null,null,null,"Please specify office location",0,0,0,0]
{"$rows_left_out":607}
{"sheet":"Submission Overview","index":3,"n_rows":51,"n_cols":8,"rows_kept":51,"cut":false,"hidden":false,"merged":[[19,1,19,2],[18,1,18,2],[17,1,17,2],[24,1,24,2],[23,1,23,2],[22,1,22,2],[21,1,21,2],[20,1,20,2],[29,1,29,2],[28,1,28,2],[27,1,27,2],[26,1,26,2],[25,1,25,2],[1,1,1,7],[2,1,2,7],[3,1,3,7],[16,1,16,2],[15,1,15,2],[6,5,6,7],[7,1,7,2]]}
[]
[null,{"$f":"Instructions!C8","v":"UK"}]
[null,{"$f":"Instructions!C9","v":"Please enter AGENCY"}]
[null,"SUBMISSION OVERVIEW"]
[]
[null,"Please review your submission by Scope of Work in the table below."]
[null,"Proposed Effective Commission Rate has been calculated and can be found in the table to the right.",null,"Estimated Annual Net Media Spend",null,"Framework Commission"]
[null,"Please state if a discount off the Agency Profit Cost would be offered in the scenario that a central client would be willing to pay the Agency Profit Cost. Please complete cell G13. Please note: this will not be part of the scoring assessment.",null,23289000,null,"Framework Commission",{"$f":"SUM(G9:G11)","v":349335},{"$f":"G8/$D$8","v":1.4999999999999999E-2}]
[null,null,null,null,null,"CCS Levy",{"$f":"$D$8*H9","v":232890},0.01]
[null,null,null,null,null,"Contingency Surplus",{"$f":"$D$8*H10","v":116445},5.0000000000000001E-3]
[null,null,null,null,null,"Agency Profit Cost",{"$f":"$E$15","v":0},{"$f":"G11/$D$8","v":0}]
[]
[null,null,null,null,null,"% Discount on Agency Profit Cost"]
[null,"If % Time (FTE) is highlighted red against any specific Scope of Work, you must review your submission and ensure that at least 100% FTE is proposed."]
[null,null,null,{"$f":"SUM(D17:D30)","v":0},{"$f":"SUM(E17:E30)","v":0},{"$f":"SUM(F17:F30)","v":0},{"$f":"SUM(G17:G30)","v":0},{"$f":"E15/$D$8","v":0}]
[null,"Scope of Work",null,"Agency Cost","Agency Profit Cost","% Time (FTE)","% Total Fee","% Effective Commission Rate"]
[null,"OOH Media Implementation",null,{"$f":"SUMIFS('FTE Overview'!$J$23:$J$1048576,'FTE Overview'!$B$23:$B$1048576,'Submission Overview'!B17)","v":0},{"$f":"SUMIFS('FTE Overview'!$L$23:$L$1048576,'FTE Overview'!$B$23:$B$1048576,'Submission Overview'!B17)","v":0},{"$f":"SUMIFS('FTE Overview'!$G$23:$G$1048576,'FTE Overview'!$B$23:$B$1048576,'Submission Overview'!B17)","v":0},{"$f":"IFERROR(D17/SUM($D$17:$D$30),0)","v":0},{"$f":"E17/$D$8","v":0}]
[null,"OOH Media Buying",null,{"$f":"SUMIFS('FTE Overview'!$J$23:$J$1048576,'FTE Overview'!$B$23:$B$1048576,'Submission Overview'!B18)","v":0},{"$f":"SUMIFS('FTE Overview'!$L$23:$L$1048576,'FTE Overview'!$B$23:$B$1048576,'Submission Overview'!B18)","v":0},{"$f":"SUMIFS('FTE Overview'!$G$23:$G$1048576,'FTE Overview'!$B$23:$B$1048576,'Submission Overview'!B18)","v":0},{"$f":"IFERROR(D18/SUM($D$17:$D$30),0)","v":0},{"$f":"E18/$D$8","v":0}]
[]
[]
[]
[]
[]
[]
[]
[]
[]
[]
[]
[]
[]
[]
[]
[]
[]
[]
[null,"Please refer to table below for breakdown of submission by deliverable"]
[null,null,null,{"$f":"SUM(D40:D51)","v":0},{"$f":"SUM(E40:E51)","v":0},{"$f":"SUM(F40:F51)","v":0}]
[null,"Scope of Work","Deliverable","Agency Cost","Agency Profit Cost","% Time (FTE)","% Scope of Work Fee","% Effective Commission Rate"]
[null,"OOH Media Implementation","OOH Media Plan Document(s) ",{"$f":"SUMIFS('FTE Overview'!$J$23:$J$1048576,'FTE Overview'!$B$23:$B$1048576,'Submission Overview'!B40,'FTE Overview'!$C$23:$C$1048576,'Submission Overview'!C40)","v":0},{"$f":"SUMIFS('FTE Overview'!$L$23:$L$1048576,'FTE Overview'!$B$23:$B$1048576,'Submission Overview'!B40,'FTE Overview'!$C$23:$C$1048576,'Submission Overview'!C40)","v":0},{"$f":"SUMIFS('FTE Overview'!$G$23:$G$1048576,'FTE Overview'!$B$23:$B$1048576,'Submission Overview'!B40,'FTE Overview'!$C$23:$C$1048576,'Submission Overview'!C40)","v":0},{"$f":"IFERROR(D40/SUMIFS($D$40:$D$51,$B$40:$B$51,B40),0)","v":0},{"$f":"E40/$D$8","v":0}]
{"$rows_left_out":12}
{"sheet":"Definition of Terms","index":4,"n_rows":24,"n_cols":4,"rows_kept":24,"cut":false,"hidden":false,"merged":[[4,1,12,1],[13,1,14,1],[15,1,20,1],[1,1,1,3],[21,1,23,1]]}
[]
[null,"Definition of Terms"]
[]
[null,null,"Term","Definition"]
[null,"Direct Labour Cost","Managing Partner","Member of Group or Agency Board. Minimum experience 7+ years."]
[null,null,"Senior Director","Senior Director level/Team Lead and ultimate responsibility for the team output minimum experience 7+ years."]
[null,null,"Director","Director level, general management responsibility for team, unit, discipline, specialism within agency. Minimum experience 5+ years"]
[null,null,"Senior Account Manager","Day to day management responsibility for team, unit, discipline, specialism within agency. Minimum experience 5+ years."]
[null,null,"Account Manager","Manages 2 or more executives, reporting into senior manager/associate director. Minimum experience 3+ years."]
[null,null,"Senior Executive","No management responsibilities, reporting into Manager, between 1 and 3 years experience "]
[null,null,"Executive","No management responsibilities. Minimum experience 1+ years."]
[null,null,"Banded Direct Labour Cost","Base cost for the level of seniority detailed"]
[null,null,"Total Direct Labour Cost","Base cost for the level of seniority detailed multiplied by % FTE "]
[null,"Overhead Factor","Office Location","The Agency must enter office locations and corresponding overhead factor."]
[null,null,"% Overhead Factor","Services considered to be included in the overhead factor are as follows: all non specified Senior Leadership roles,  all Advertising Operation Services, all Travel and sustenance costs."]
[null,"Profit","Profit","The Agency fee shall be based upon an anually reviewed fixed cost plus an agreed upon profit margin %"]
[null,null,"% Profit Margin","The Agency can make a proposal on profit margin up to 20%. A percentage of the Agency's profit margin must be subject to PRF."]
[null,null,"% Subject to PRF","The Agency can made a proposal on profit margin subject to PRF between 1-50%. i.e. profit margin set at 15%, with 50% of this subject to RPF"]
[null,null,"Total Agency Profit Cost","Total Agency cost inclusive of overhead and profit "]
[null,null,"Non PRF Related","% of Agency profit not related to PRF "]
[null,null,"PRF Related","% of Agency profit subject to PRF "]
[null,"Framework Commission","Framework Commission","Sum of CCS Levy, Contingency Surplus and Total Agency Profit Cost "]
[null,null,"CCS Levy","1% levy applied to all media spend to support CCS "]
[null,null,"Contingency Surplus","0.5% CCS contingency to cover unexpected costs which can't be accounted for in advance"]