{"text_format":"1","workbook":"xlsx","n_sheets":4,"sheets":["PSA 11 Form","Guidance","PSA Team Use","Data Validation Sheet"],"not_rendered":{"charts":0,"images":0,"macros":1,"external_links":1,"defined_names":12,"comments":0,"pivot_tables":0},"unopened":[],"bounds":{"document_bytes":16777216,"sheet_cells":100000,"rows_first":2000,"rows_last":500,"rows_between":2000,"halvings":0,"cell_chars":16384,"cell_head_chars":4096},"cells_cut":0,"cells_raw":0,"read":"whole","date_system":"1900"}

{"sheet":"PSA 11 Form","index":0,"n_rows":48,"n_cols":14,"rows_kept":48,"cut":false,"hidden":false,"merged":[[47,2,48,6],[21,2,21,3],[41,11,41,12],[24,1,24,3],[31,2,37,6],[44,2,46,6],[26,2,26,6],[36,10,36,14],[47,11,47,12],[47,13,47,14],[41,5,41,6],[41,13,41,14],[45,11,45,12],[41,2,42,4],[26,10,26,11],[28,8,28,9],[1,1,1,15],[11,4,11,6],[6,4,6,5],[11,2,11,3],[4,2,4,3],[6,2,6,3],[8,4,9,6],[5,8,13,14],[13,2,13,3],[13,4,13,6],[8,2,8,3],[17,1,17,5],[27,2,30,6],[26,8,26,9],[19,1,19,4],[4,4,4,5],[15,8,16,12],[30,10,30,14],[19,5,19,6],[45,13,45,14],[43,11,43,12],[43,13,43,14],[20,4,20,5],[18,9,19,14],[39,5,39,6],[38,9,39,14],[34,13,34,14],[32,10,32,11],[21,11,21,14],[32,8,32,9],[36,8,36,9],[34,10,34,11],[34,8,34,9],[28,10,28,14],[30,8,30,9]]}
[]
[null,"PSA 11 Form - Publishing a Live Opportunity - version 2"]
[]
[]
[null,null,"Omnicom Ref:   ",null,"C27067",null,null,null,"Approval for publication statement:"]
[null,null,null,null,null,null,null,null,"I confirm that the uploaded documents and information contain and require no protectve marking and have been approved and cleared for publication, and may be freely published.\n\nI confirm that businesslink.gov.uk is not responsible or liable for the contents and accuracy of the attached documents and information. \n\nI understand that it is neither businesslink.gov.uk's responsibility to protectively mark documents submitted nor to check that any appropriate marking has been made. I understand that this is an automated process and businesslink.gov.uk cannot check the contents and accuracy of the attached documents.\n\nI also understand that all fields in this spreadsheet must be completed and confirm that I have done so, and that failure to do so will result in the request for publication being returned to the sender."]
[null,null,"Ref if not on Omnicom:   "]
[]
[null,null,"Contract Title:   ",null,"Provision of weir wire ropes and fittings for the Thames Area"]
[]
[]
[null,null,"Contract Description:   ",null,"Provision of supply of stainless-steel marine grade components for underwater structures for the Thames Area.\n\n• Approx.700 wire assemblies over 4 years (2+1+1)\n\n• Wire ropes at specified materials, diameters and lengths ( Stainless steel 12mm – 26mm wire thickness, 5m -15m length, between 3 - 8 ton lifting capacity )\n\n• Fixtures and fittings at specified materials, sizes and configuration ( marine grade stainless steel D shackles of specified sizes, Swaged ends, Spelter Sockets, U-Bolts, Bulldogs, and other similar products)\n\n• QA Certificates to ensure the working load limits are within specification\n\n• Accurate lead times for delivery "]
[]
[null,null,"Category Code:   ",null,"Sea Structures (eg. Buoys, navigation markers, palling)"]
[]
[null,null,null,"Contract Type:   ","Supplies",null,null,null,"I would like this apportunity published and agree with above publication statement:   "]
[]
[null,"Is this a Framework Agreement or part of one:   ",null,null,null,null,"No",null,"If you answered No to the above please state a reason for non publication below"]
[]
[null,"Deadline Date for Registering Interest:   ",null,null,null,"2025-01-17"]
[]
[null,null,"Est Contract Value:   ",null,null,null,null,null,"Checked for release by:"]
[null,null,null,"From:   ",120000,"To:   ",240000]
[]
[null,"Estimated Contract Duration:",null,null,24,"Unit:   ","Months",null,"Contact Information for registering interest and questions:"]
[]
[null,null,"How to Apply Instructions to Suppliers:",null,null,null,null,null,"Contact name:   ",null,"Lu Mao"]
[null,null,"Please provide details to help suppliers understand the procurement process you are following. Try to give enough information to ensure that suppliers respond to you properly. This information will be included in the 'How to Apply' section for suppliers."]
[null,null,null,null,null,null,null,null,"Address Line 1:   ",null,"Guildbourne House"]
[]
[null,null,null,null,null,null,null,null,"Address Line 2:   ",null,"Chatsworth Road"]
[null,null,"The opportunity is being administered on Defra’s e-tendering portal:\nhttps://defra-family.force.com/s/Welcome\nIf you are interested in this tender, please register your interest on the above portal, by 17:00, 17/01/2025. \n\nGovernment Classification of: Official Sensitive \n\nAll weirs in the Thames area which use wire ropes (stainless steel) and suitable shackles to lift and lower gates during operation and maintenance, require routine wire rope replacement. \nThe replacement requires the manufacture of gate specific wire ropes, built to individual asset specifications of length, thickness, working load limits, ends (e.g. hard eye, swaged studs, fused and tapered) and shackle type. Once manufactured, these must be delivered to the EA Depot for the EA's diving contractor who will install them.\n\nThe supplier must have:\n• Relevant experience \n• Ability to provide QA Certificates to ensure the working load limits are within specification\n• Ability to meet the lead times for delivery\n\nThe Contractor may subcontract the provision of weir ropes, fixtures and fittings however, it must not affect the Contractor’s ability to fulfil its obligations under the contract. \n\nThe following will be provided in the Bidder Pack, which will be published to the suppliers who registered their interest on Defra's e-tendering portal:\n•.Procurement process for each item\n•.Specification \n\n\n"]
[null,null,null,null,null,null,null,null,"Town or City:   ",null,"Worthing"]
[]
[null,null,null,null,null,null,null,null,"County:   ",null,"East Sussex",null,"P Code:","BN11 1LD"]
[]
[null,null,null,null,null,null,null,null,"Email Address:   ",null,"lu.mao@defra.gov.uk"]
[]
[null,null,null,null,null,null,null,null,null,"PSA Team Use Only:\n(Please do not enter any information into the fields below)"]
[null,null,"Procurement Contact Name",null,null,"Lu Mao"]
[]
[null,null,"Client Name (if no Procurement Contact)",null,null,null,null,null,null,"Omnicom Reference:   ",{"$f":"\"EA\" & \" - \" & E5","v":"EA - C27067"},"Other Reference:   ",null,{"$f":"\"EA\" & \" - \" & E7","v":"EA - "}]
[]
[null,null,null,null,null,null,null,null,null,"Date Received:"]
[]
[null,null,null,null,null,null,null,null,null,"Date Published:",null,"PSPES Code Level 1:   ",null,{"$f":"VLOOKUP(E14,'Data Validation Sheet'!$E$1:$F$409,2,FALSE)","v":"Operational Goods & Services"}]
[]
[null,null,null,null,null,null,null,null,null,"Actioned by:",null,"PSPES Code Level 2:   ",null,{"$f":"VLOOKUP(E14,'Data Validation Sheet'!$G$1:$H$409,2,FALSE)","v":"Environmental Materials"}]

{"sheet":"Guidance","index":1,"n_rows":20,"n_cols":2,"rows_kept":20,"cut":false,"hidden":false,"merged":[[0,0,0,1]]}
["The guidance shown below will assist you in filling in the fields correctly on the PSA 12 Form"]
[]
["Field Name","What to enter"]
["Omnicom Ref","Enter the contract number that Omnicom has assigned"]
["Ref is not on Omnicom","If your contract is not on Omnicom as it may be under £25k then enter the reference that has been assigned to it."]
["Contract Title","The title that you have given the apportunity. This must be clear and easy to understand"]
["Contract Description","A description of the opportunity giving a little bit more information than the title."]
["Category Code","Select the category from the drop down list"]
["Contract Type","Select from the drop down list"]
["Is this a Framework Agreement or part of one","Select Yes or No to show whether this is a Framework Agreement or a call off from an existing Framework"]
["Deadline Date for registering interest","This is the final date that a supplier can register an interest"]
["Estimated Contract Value","This has fields for From and To so you can give an estimate between two values. These can be the same if you have an exact figure."]
["Estimated Contract Duration","This is how long the contract will go on for. You can enter a figure in days or months"]
["Unit","Select Days or Months depending on the figure you have entered in the Duration field."]
["How to apply instructions to suppliers","Please add information here that will assist a supplier in registering interest i.e. whether you only want responses by the email shown."]
["Procurement Contact Name","This is the Procurement Person responsible for the contract"]
["Client Name (of no Procurement Contact)","If you are unable to fill in the Procurement Contact Name field then enter the name of the Client"]
["Agreement with above publication statement","Select Yes from the drop down menu to say you have read and understand the Approval for publication statement. Select No if this should not be published and we need to report this as an exception"]
["Checked for release by","This is the person that has checked that everything you are sending is appropriate for publication."]
["Contact Information for registering interest","This is the details of the person where the registration for interest should be sent, including email address (not the Proc-Sysadmin email address)"]

{"sheet":"PSA Team Use","index":2,"n_rows":5,"n_cols":14,"rows_kept":5,"cut":false,"hidden":true,"merged":[[2,5,2,6]]}
["This list will automatically complete from the form and the PSA Team will use it to copy onto the record of tenders published"]
[]
[null,null,null,null,null,"Estimated Contract Value"]
["Date Published","Reference Number","Contract Title","Category Code","Contract Type","From","To","Duration","Unit","Procurement Contact Name","Contact name for Registering Interest","Contact Email Address","Published On Contracts Finder? (Yes/No)","If not Published then reason for Non Publication"]
[{"$f":"TODAY()","v":"2024-12-09"},{"$f":"'PSA 11 Form'!K42","v":"EA - C27067"},{"$f":"'PSA 11 Form'!E9","v":"Provision of weir wire ropes and fittings for the Thames Area"},{"$f":"'PSA 11 Form'!E14","v":"Sea Structures (eg. Buoys, navigation markers, palling)"},{"$f":"'PSA 11 Form'!E16","v":"Supplies"},{"$f":"'PSA 11 Form'!E23","v":120000},{"$f":"'PSA 11 Form'!G23","v":240000},{"$f":"'PSA 11 Form'!E25","v":24},{"$f":"'PSA 11 Form'!G25","v":"Months"},{"$f":"'PSA 11 Form'!F40","v":"Lu Mao"},{"$f":"'PSA 11 Form'!K27","v":"Lu Mao"},{"$f":"'PSA 11 Form'!K37","v":"lu.mao@defra.gov.uk"},{"$f":"'PSA 11 Form'!N16","v":0},{"$f":"'PSA 11 Form'!J19","v":0}]

{"sheet":"Data Validation Sheet","index":3,"n_rows":383,"n_cols":8,"rows_kept":383,"cut":false,"hidden":true,"merged":[]}
["Yes","Mark Roddan","Accident Management - Accident Damage/Vandalism - Cars","Competition as part of existing framework","Accident Management Costs","Vehicles","Accident Management Costs","Vehicle Maintenance"]
["No","Mark Reynolds","Accident Management - Accident Management/Vandalism - Commercials","Procurement of a new requirement","Accident Management - Accident Damage/Vandalism - Cars","Vehicles","Accident Management - Accident Damage/Vandalism - Cars","Vehicle Maintenance"]
[null,"Lee Cook","Accident Management - Vehicle Write Off - Cars","e-auction","Accident Management - Accident Management/Vandalism - Commercials","Vehicles","Accident Management - Accident Management/Vandalism - Commercials","Vehicle Maintenance"]
[null,"Emma Jefferies","Accident Management - Vehicle Write Off - Commercials","Establishing new framework agreement","Accident Management - Vehicle Write Off - Cars","Vehicles","Accident Management - Vehicle Write Off - Cars","Vehicle Maintenance"]
[null,null,"Accreditation Services","Recompetition of an existing requirement","Accident Management - Vehicle Write Off - Commercials","Vehicles","Accident Management - Vehicle Write Off - Commercials","Vehicle Maintenance"]
[null,null,"Advertising (not Statutory or Recruitment Advertising)",null,"Accommodation - Overnight","Travel & Events","Accommodation - Overnight","Hotels "]
["Days",null,"Aerial Surveys",null,"Accounting","Professional Services Financial Services","Accounting","Accountancy Services "]
["Months",null,"Air Monitoring Instrumentation",null,"Accreditation Services","Professional Services Financial Services","Accreditation Services","Audit Services"]
[null,null,"Aircraft Hire",null,"Advertising (not Statutory or Recruitment Advertising)","Marketing & Media","Advertising (not Statutory or Recruitment Advertising)","Advertising"]
[null,null,"Alcohols",null,"Aerial Surveys","Professional Services Other","Aerial Surveys","Environmental Services"]
["Service",null,"Auditors Services",null,"Air Conditioning Systems","Construction","Air Conditioning Systems","Construction Supplies"]
["Supplies",null,"Bikes Initiative",null,"Air Monitoring Instrumentation","Operational Goods & Services","Air Monitoring Instrumentation","Environmental Materials"]
["Works",null,"Boats - Biodegradable Oils and Lubricants",null,"Aircraft Hire","Vehicles","Aircraft Hire","Leasing "]
[null,null,"Boats - Non-Biodegradable Oils and Lubricants",null,"Alcohols","Clinical & Medical","Alcohols","Pathology"]
[null,null,"Boats and all marine craft - Hire",null,"Assessment Services","Professional Services Other","Assessment Services","Operational Services"]
[null,null,"Boats and all Marine Craft - Purchase",null,"Auditors Services","Professional Services Financial Services","Auditors Services","Audit Services"]
[null,null,"Boats and all marine craft - Service, Repairs and Spares",null,"Badged Vehicle Accident & Repair Services","Vehicles","Badged Vehicle Accident & Repair Services","Vehicle Maintenance"]
[null,null,"Bottles (Labs only)",null,"Banking and Investment","Professional Services Financial Services","Banking and Investment","Banking & Investment Services"]
[null,null,"Buses and Taxis",null,"Bikes Initiative","Vehicles","Bikes Initiative","Purchase"]
[null,null,"Business Administration Services",null,"Boats - Biodegradable Oils and Lubricants","Fuels Lubricants & Gases","Boats - Biodegradable Oils and Lubricants","Fuels"]
[null,null,"Business Rates",null,"Boats - Non-Biodegradable Oils and Lubricants","Fuels Lubricants & Gases","Boats - Non-Biodegradable Oils and Lubricants","Fuels"]
[null,null,"Call Centre Services",null,"Boats - Oils and Lubricants","Fuels Lubricants & Gases","Boats - Oils and Lubricants","Fuels"]
[null,null,"Cap gemini Service Charge",null,"Boats and all marine craft - Fuel - DERV","Fuels Lubricants & Gases","Boats and all marine craft - Fuel - DERV","Fuels"]
[null,null,"Car Park Equipment Supply and Maintenance",null,"Boats and all marine craft - Hire","Vehicles","Boats and all marine craft - Hire","Leasing"]
[null,null,"Cash Collection / Delivery Service",null,"Boats and all Marine Craft - Purchase","Vehicles","Boats and all Marine Craft - Purchase","Purchase"]
[null,null,"Chemicals",null,"Boats and all marine craft - Service, Repairs and Spares","Vehicles","Boats and all marine craft - Service, Repairs and Spares","Vehicle Maintenance"]
[null,null,"Childcare Assistance",null,"Borehole Drilling","Construction","Borehole Drilling","Main Contractors"]
[null,null,"Childcare Assistance Service Charge",null,"Bottles (Labs only)","Clinical & Medical","Bottles (Labs only)","Pathology"]
[null,null,"Cleaning materials/equipment purchased by EA",null,"Buffet","Facilities","Buffet","Food"]
[null,null,"Collaborative/Externally Funded Projects",null,"Building Support and Maintenance and Repair Services","Construction","Building Support and Maintenance and Repair Services","Building Repair & Maintenance"]
[null,null,"Communications Devices and Accessories (eg Telephones)",null,"Buses and Taxis","Travel & Events","Buses and Taxis","Vehicle Hire"]
[null,null,"Compensation",null,"Business Administration Services","Facilities","Business Administration Services","Building Management"]
[null,null,"Comprehensive Health Services",null,"Business Cards","Office Solutions","Business Cards","Print"]
[null,null,"Computer Consumables",null,"Business Rates","Facilities","Business Rates","Building Management"]
[null,null,"Computer Equipment and Accessories (eg Computer Hardware)",null,"Call Centre Services","ICT","Call Centre Services","Telecoms"]
[null,null,"Computer Hardware and Accessories",null,"Cap gemini Service Charge","ICT","Cap gemini Service Charge","Managed/Outsource Services"]
[null,null,"Computer Maintenance",null,"Car Park Equipment Supply and Maintenance","Facilities","Car Park Equipment Supply and Maintenance","Building Management"]
[null,null,"Computer Rental",null,"Carbon Based Chemicals and Compounded Chemicals","Clinical & Medical","Carbon Based Chemicals and Compounded Chemicals","Pathology"]
[null,null,"Computer Services",null,"Cash Collection / Delivery Service","Office Solutions","Cash Collection / Delivery Service","Post & Courier"]
[null,null,"Concrete",null,"Chemicals","Clinical & Medical","Chemicals","Pathology"]
[null,null,"Conference Attendance Fees (inc Speakers)",null,"Childcare Assistance","Personnel Related","Childcare Assistance","Staff Childcare"]
[null,null,"Consumables (Labs only)",null,"Childcare Assistance Service Charge","Personnel Related","Childcare Assistance Service Charge","Staff Childcare"]
[null,null,"Coppiced material : Documentary proof of source and legal use rights obtained",null,"Civil Engineering","Construction","Civil Engineering","Main Contractors"]
[null,null,"Corporate Affairs Services",null,"Cleaning Equipment","Facilities ","Cleaning Equipment","Cleaning"]
[null,null,"Corporate Clothing",null,"Cleaning Materials","Facilities ","Cleaning Materials","Cleaning"]
[null,null,"Cost Consultants",null,"Cleaning materials/equipment purchased by EA","Facilities ","Cleaning materials/equipment purchased by EA","Cleaning"]
[null,null,"Courier Services (excluding labs)",null,"Cleaning Services","Facilities ","Cleaning Services","Cleaning"]
[null,null,"Courier Services (Labs only)",null,"Clothing","Operational Goods & Services","Clothing","Clothing"]
[null,null,"Data Acquisition or Purchase",null,"Collaborative Contracts","Non Procurement Related","Collaborative Contracts","Non Procurement Related"]
[null,null,"Data Communications",null,"Collaborative/Externally Funded Projects","Non Procurement Related","Collaborative/Externally Funded Projects","Non Procurement Related"]
[null,null,"Demountable Flood Defences",null,"Commission","No Code","Commission","No Code"]
[null,null,"Diving Services",null,"Communications Devices and Accessories (eg Telephones)","ICT","Communications Devices and Accessories (eg Telephones)","Telecoms"]
[null,null,"Drainage Charges",null,"Compensation","Non Procurement Related","Compensation","Non Procurement Related"]
[null,null,"Dredging Works",null,"Comprehensive Health Services","Personnel Related","Comprehensive Health Services","Staff Medical Care"]
[null,null,"Economics Consultancy",null,"Computer Consumables","Office Solutions","Computer Consumables","Office Consumables"]
[null,null,"Electrical Components and Supplies",null,"Computer Equipment and Accessories (eg Computer Hardware)","ICT","Computer Equipment and Accessories (eg Computer Hardware)","Hardware"]
[null,null,"Electricity from Non-renewable Sources (Non-Climate Change Levy Exempt)",null,"Computer Hardware and Accessories","ICT","Computer Hardware and Accessories","Hardware"]
[null,null,"Electricity from Renewable Sources (Climate Change Levy Exempt)",null,"Computer Maintenance","ICT","Computer Maintenance","Maintenance & Support"]
[null,null,"Enforcement Stationery",null,"Computer Rental","ICT","Computer Rental","Hardware"]
[null,null,"Engineering Consultants (civils consultancy works not on NEECA)",null,"Computer Services","ICT","Computer Services","Maintenance & Support"]
[null,null,"Engineering Contractors (civils works not on NCF)",null,"Concrete","Construction","Concrete","Construction Supplies"]
[null,null,"Environmental Consultancy (not civils)",null,"Conference Attendance Fees (inc Speakers)","Personnel Related","Conference Attendance Fees (inc Speakers)","Events Admissions"]
[null,null,"Environmental Monitoring Instrumentation",null,"Consumables (Labs only)","Clinical & Medical","Consumables (Labs only)","Pathology"]
[null,null,"Environmental Protection Equipment",null,"Containers and Storage","Office Solutions","Containers and Storage","Office Supplies"]
[null,null,"Environmental Services Framework (ESF NEAS)",null,"Contractor Payments","Construction","Contractor Payments","Main Contractors"]
[null,null,"Environmental Services Framework (ESF Non-NEAS)",null,"Coppiced material : Documentary proof of source and legal use rights obtained","Construction","Coppiced material : Documentary proof of source and legal use rights obtained","Construction Supplies"]
[null,null,"EPCRS Consultancy Framework",null,"Corporate Affairs Services","Marketing & Media","Corporate Affairs Services","Marketing"]
[null,null,"Estate Services",null,"Corporate Clothing","Operational Goods & Services","Corporate Clothing","Clothing"]
[null,null,"Executive Search and Selection",null,"Cost Consultants","Construction","Cost Consultants","Construction Service Providers"]
[null,null,"Facilities Management Consultancy",null,"Courier Services (excluding labs)","Office Solutions","Courier Services (excluding labs)","Post & Courier"]
[null,null,"Fencing Materials - Steel",null,"Courier Services (Labs only)","Office Solutions","Courier Services (Labs only)","Post & Courier"]
[null,null,"First Aid Supplies",null,"Data Acquisition or Purchase","Non Procurement Related","Data Acquisition or Purchase","Non Procurement Related"]
[null,null,"Fish & Related Products",null,"Data Acquisition or Purchase","Non Procurement Related","Data Acquisition or Purchase","Non Procurement Related"]
[null,null,"Fisheries Agents",null,"Data Communications","ICT","Data Communications","Networking"]
[null,null,"Fisheries Services and Consultancy",null,"Decontamination Services","Professional Services Other","Decontamination Services","Environmental Services"]
[null,null,"Fixed Plant - Hire",null,"Demountable Flood Defences","Construction","Demountable Flood Defences","Construction Supplies"]
[null,null,"Fixed Plant - Purchase",null,"Design & Print Services","Office Solutions","Design & Print Services","Print"]
[null,null,"Fixed Plant - Service, Repairs and Spare",null,"Diodes and Transistors and Semiconductor Devices","Operational Goods & Services","Diodes and Transistors and Semiconductor Devices","Environmental Materials"]
[null,null,"Flood Management Consultancy (not civils)",null,"Diving Services","Professional Services Technical Services","Diving Services","Marine, Coastal & Inland Waterways Services"]
[null,null,"Floor Coverings",null,"Drainage Charges","Professional Services Other","Drainage Charges","Environmental Services"]
{"$rows_left_out":303}