{"text_format":"1","workbook":"xlsx","n_sheets":6,"sheets":["Cover Sheet","PLEASE READ INSTRUCTIONS","Day Rate Minimums & Caps","UK Rate Card - evaluated","Offshore Rate Card","EVALUATED"],"not_rendered":{"charts":0,"images":0,"macros":0,"external_links":0,"defined_names":0,"comments":0,"pivot_tables":0},"unopened":[],"bounds":{"document_bytes":16777216,"sheet_cells":100000,"rows_first":2000,"rows_last":500,"rows_between":2000,"halvings":0,"cell_chars":16384,"cell_head_chars":4096},"cells_cut":0,"cells_raw":0,"read":"whole","date_system":"1900"}

{"sheet":"Cover Sheet","index":0,"n_rows":3,"n_cols":2,"rows_kept":3,"cut":false,"hidden":false,"merged":[]}
[null,"Attachment 3 - Pricing Matrix v1.0                                                                                                                                                                                                                                                                                 Digital Capability for Health 2                                                                                                                                                                                                                                                                       Contract Reference: RM6345"]
[]
[null,"MANDATORY: Please enter Bidders NAME in the text box below"]

{"sheet":"PLEASE READ INSTRUCTIONS","index":1,"n_rows":26,"n_cols":6,"rows_kept":26,"cut":false,"hidden":false,"merged":[[0,0,0,9],[1,0,1,9],[2,0,2,9],[4,0,4,9],[5,0,5,9],[6,0,6,9],[8,0,8,9],[9,0,9,9],[10,0,10,9],[11,0,11,9],[12,0,12,9],[13,0,13,9],[15,0,15,9],[16,0,16,9],[17,0,17,9],[18,0,18,11],[19,0,19,11],[20,0,20,11],[21,0,21,9],[22,0,22,11],[23,0,23,9],[35,0,35,11],[36,0,36,11],[37,0,37,11],[38,0,38,11],[25,0,25,6],[39,0,39,11],[40,0,40,11],[24,0,24,11],[26,0,26,9],[27,0,27,9],[30,0,30,9],[32,0,32,11],[33,0,33,11],[34,0,34,11]]}
["Contract Reference: RM6345 Attachment 3 - Pricing Matrix                                                                                                                                                                                                                                                                "]
["Before completing the Pricing Matrix, Bidders are requested to read 'Attachment 2 - How to Bid'. This document contains instructions on how to complete this pricing schedule as well as how this will be evaluated."]
["Note if a tender is deemed non compliant, the tender may be excluded and you may be excluded from further participation in the Procurement. "]
["Mandatory\nGreen Cells - Table 2 UK rate card\nenter your prices\n","No input required\nRed cells - Table 3 Validation will auto highlight a non-compliant price entered in Table 2","No input required\nYellow Cells - Tables 3 and 7 will validates and indicate if you have not entered a price in the mandatory and optional cells","No input required\nGrey Cells are for CCS use only ","Optional \nBlue Cells - Table 6 Offshore Rate Card","No input required - Table 9 - will be used for evaluation"]
["Bidders are required to complete the cells within the following tabs: (I) 'UK Rate Card' table 2 (highlighted green) and OPTIONAL (iii) 'Offshore Rate Card' table 6 (highlighted blue). \nPlease note the following: \n•\tday rate minimums and caps must be adhered to when completing the pricing schedule. \n•\toffshore rates must not exceed the rate supplied at national level (Table 2 Colum D)"]
["TAB - Day Rate Minimums & Caps"]
["Do not amend this TAB"]
[]
["UK Rate Card - to be evaluated"]
["Failure to enter a price for all of the roles that we have asked you for may result in your bid being deemed non-compliant. \nBidders should note that the validation of price inputs table (UK Rate Card Table 3) will automatically  highlight if you have  entered a non compliant price for the following reasons:                                                                                    \n1 - Price entered is above the CAP in Table 1 \"Day Rate Minimums & Caps\" \n2 - Price entered for a senior role is less than a junior role for example the price entered for an Associate Business Architect should be entered more than or equal to the cost of a Trainee Business Architect\n3 - Price entered is Below Minimum benchmark as per Table 1 in \"Day Rate Minimums & Caps\" this includes zero (0.00) pricing  \n4 - You have not entered a price into Table 2 corresponding cell                                                                                                                                                                                                                                                                                                     "]
["If you do not achieve a 'Pass' in each of the cells of the validation table then your response may be deemed non compliant. The validation table can be found in Table 3 Columns H to K in the UK Rate Card."]
["Offshore Rate Card - table 8"]
["Bidders may, if they have the capability, provide offshore rates. This will not be evaluated. If applicable, bidders must enter the geographic location to which the offshore rates apply in cell P4, Q4 and R4 of the Offshore Rate Card tab. Bidders should note that the validation of price inputs table will automatically highlight if you have submitted a failed price base on the following:                                                                                                                                                                                                                                                                                         "]
["1 - Price greater than National Day Rate in UK Rate Card"]
["Evaluation Table"]
{"$rows_left_out":12}
{"sheet":"Day Rate Minimums & Caps","index":2,"n_rows":5,"n_cols":4,"rows_kept":5,"cut":false,"hidden":false,"merged":[]}
[]
[null,"Table 1 - Day Rate Minimums & Caps - DO NOT AMEND"]
[null,null,"Day Rate Cap","Day Rate Minimum"]
[null,"National Rate Card",1100,100]
[null,"London Rate Card",1300,100]

{"sheet":"UK Rate Card - evaluated","index":3,"n_rows":245,"n_cols":20,"rows_kept":245,"cut":false,"hidden":false,"merged":[[169,16,169,17],[169,7,169,8],[170,7,178,7],[180,12,185,12],[187,12,195,12],[197,12,197,13],[180,7,185,7],[187,7,195,7],[197,7,197,8],[180,16,185,16],[187,16,195,16],[197,16,197,17],[108,16,112,16],[114,12,115,12],[114,16,115,16],[117,12,120,12],[117,16,120,16],[122,16,125,16],[108,12,112,12],[122,12,125,12],[127,16,127,17],[48,16,49,16],[62,16,66,16],[31,16,35,16],[37,16,37,17],[38,16,41,16],[43,16,46,16],[51,12,53,12],[55,12,60,12],[62,12,66,12],[51,16,53,16],[43,12,46,12],[48,12,49,12],[55,16,60,16],[31,12,35,12],[37,12,37,13],[38,12,41,12],[69,7,73,7],[75,7,77,7],[79,7,81,7],[83,7,86,7],[69,12,73,12],[128,12,133,12],[135,12,138,12],[140,12,143,12],[94,7,97,7],[122,7,125,7],[127,12,127,13],[99,12,100,12],[102,12,106,12],[88,12,92,12],[94,12,97,12],[75,12,77,12],[79,12,81,12],[83,12,86,12],[88,7,92,7],[99,7,100,7],[102,7,106,7],[114,7,115,7],[117,7,120,7],[127,7,127,8],[68,16,68,17],[69,16,73,16],[75,16,77,16],[79,16,81,16],[83,16,86,16],[88,16,92,16],[94,16,97,16],[99,16,100,16],[102,16,106,16],[68,12,68,13],[37,7,37,8],[31,7,35,7],[38,7,41,7],[43,7,46,7],[48,7,49,7],[51,7,53,7],[55,7,60,7],[68,7,68,8],[62,7,66,7],[88,1,92,1],[94,1,97,1],[75,1,77,1],[8,1,10,1],[12,1,15,1],[17,1,19,1],[21,1,23,1],[25,1,29,1],[31,1,35,1],[37,1,37,2],[38,1,41,1],[43,1,46,1],[69,1,73,1],[48,1,49,1],[51,1,53,1],[55,1,60,1],[62,1,66,1],[68,1,68,2],[79,1,81,1],[83,1,86,1],[99,1,100,1],[102,1,106,1],[108,1,112,1],[114,1,115,1],[117,1,120,1],[122,1,125,1],[127,1,127,2],[128,1,133,1],[135,1,138,1],[140,1,143,1],[145,1,149,1],[155,1,155,2],[156,1,159,1],[161,1,164,1],[166,1,167,1],[169,1,169,2],[170,1,178,1],[226,1,231,1],[233,1,234,1],[236,1,241,1],[180,1,185,1],[187,1,195,1],[197,1,197,2],[198,1,201,1],[203,1,208,1],[212,1,217,1],[219,1,224,1],[0,1,0,10],[2,1,2,2],[2,7,2,8],[2,12,2,13],[3,1,6,1],[3,12,6,12],[8,12,10,12],[2,16,2,17],[3,16,6,16],[8,16,10,16],[12,16,15,16],[17,16,19,16],[21,16,23,16],[25,16,29,16],[3,7,6,7],[8,7,10,7],[12,7,15,7],[17,7,19,7],[21,7,23,7],[25,7,29,7],[12,12,15,12],[17,12,19,12],[21,12,23,12],[25,12,29,12],[135,7,138,7],[140,7,143,7],[145,7,149,7],[155,7,155,8],[156,7,159,7],[161,7,164,7],[198,12,201,12],[140,16,143,16],[145,16,149,16],[155,16,155,17],[156,16,159,16],[161,16,164,16],[166,7,167,7],[166,12,167,12],[166,16,167,16],[170,16,178,16],[135,16,138,16],[145,12,149,12],[155,12,155,13],[156,12,159,12],[161,12,164,12],[198,16,201,16],[169,12,169,13],[170,12,178,12],[108,7,112,7],[236,16,241,16],[243,18,243,19],[244,18,244,19],[226,7,231,7],[226,12,231,12],[226,16,231,16],[233,7,234,7],[233,12,234,12],[236,7,241,7],[236,12,241,12],[212,16,217,16],[219,16,224,16],[203,12,208,12],[212,12,217,12],[219,12,224,12],[203,7,208,7],[212,7,217,7],[219,7,224,7],[233,16,234,16],[203,16,208,16],[198,7,201,7],[128,16,133,16],[128,7,133,7]]}
[null,"TO BE EVALUATED  - 30% of the total evaluation. \nYou will FAIL if :                                                                                                                                                                                                                                                                                                                                                                                                                                                                                                       1 - Price is above CAP as per Table 1 in \"Day Rate Minimums & Caps\" \n2 - Price for a senior role is cheaper than a junior role e.g. Associate Business Architect should cost more than or equal to the cost of a Trainee Business Architect\n3 - Price Below Minimum benchmark as per Table 1 in \"Day Rate Minimums & Caps\""]
[null,"Table 2 - UK Rate Card - MANDATORY - enter a price in all of the green cells",null,null,null,null,null,"Table 3 - UK Rate Card validation table - DO NOT AMEND",null,null,null,null,"Table 4 - Evaluation Weighting - DO NOT AMEND",null,null,null,"Table 5 - Weighted Price for Evaluation - DO NOT AMEND"]
[null,"Architecture roles",null,"National","London",null,null,"Architecture roles",null,"National","London",null,"Architecture roles",null,"Evaluation Weighting",null,"Architecture roles",null,"Weighted Price National","Weighted Price London"]
[null,"Business architect","1. Trainee business architect",null,null,null,null,"Business architect","1. Trainee business architect",{"$f":"IF(D4=\"\",\"No Price\",IF(D4>'Day Rate Minimums & Caps'!$C$4,\"Fail 1\",IF(D4<'Day Rate Minimums & Caps'!$D$4,\"Fail 3\",\"Pass\")))","v":"No Price"},{"$f":"IF(E4=\"\",\"No Price\",IF(E4>'Day Rate Minimums & Caps'!$C$5,\"Fail 1\",IF(E4<'Day Rate Minimums & Caps'!$D$5,\"Fail 3\",\"Pass\")))","v":"No Price"},null,"Business architect","1. Trainee business architect",6.3291139240506333E-2,null,"Business architect","1. Trainee business architect",{"$f":"D4*O4","v":0},{"$f":"E4*O4","v":0}]
[null,null,"2. Associate business architect",null,null,null,null,null,"2. Associate business architect",{"$f":"IF(D5=\"\",\"No Price\",IF(D5>'Day Rate Minimums & Caps'!$C$4,\"Fail 1\",IF(D5<'Day Rate Minimums & Caps'!$D$4,\"Fail 3\",IF(D5<D4,\"Fail 2\",\"Pass\"))))","v":"No Price"},{"$f":"IF(E5=\"\",\"No Price\",IF(E5>'Day Rate Minimums & Caps'!$C$5,\"Fail 1\",IF(E5<'Day Rate Minimums & Caps'!$D$5,\"Fail 3\",IF(E5<E4,\"Fail 2\",\"Pass\"))))","v":"No Price"},null,null,"2. Associate business architect",6.3291139240506333E-2,null,null,"2. Associate business architect",0,0]
[null,null,"3. Business architect",null,null,null,null,null,"3. Business architect",{"$f":"IF(D6=\"\",\"No Price\",IF(D6>'Day Rate Minimums & Caps'!$C$4,\"Fail 1\",IF(D6<'Day Rate Minimums & Caps'!$D$4,\"Fail 3\",IF(D6<D5,\"Fail 2\",\"Pass\"))))","v":"No Price"},{"$f":"IF(E6=\"\",\"No Price\",IF(E6>'Day Rate Minimums & Caps'!$C$5,\"Fail 1\",IF(E6<'Day Rate Minimums & Caps'!$D$5,\"Fail 3\",IF(E6<E5,\"Fail 2\",\"Pass\"))))","v":"No Price"},null,null,"3. Business architect",6.3291139240506333E-2,null,null,"3. Business architect",0,0]
[null,null,"4. Lead business architect",null,null,null,null,null,"4. Lead business architect",{"$f":"IF(D7=\"\",\"No Price\",IF(D7>'Day Rate Minimums & Caps'!$C$4,\"Fail 1\",IF(D7<'Day Rate Minimums & Caps'!$D$4,\"Fail 3\",IF(D7<D6,\"Fail 2\",\"Pass\"))))","v":"No Price"},{"$f":"IF(E7=\"\",\"No Price\",IF(E7>'Day Rate Minimums & Caps'!$C$5,\"Fail 1\",IF(E7<'Day Rate Minimums & Caps'!$D$5,\"Fail 3\",IF(E7<E6,\"Fail 2\",\"Pass\"))))","v":"No Price"},null,null,"4. Lead business architect",6.3291139240506333E-2,null,null,"4. Lead business architect",0,0]
[]
[null,"Data architect","1. Data architect",null,null,null,null,"Data architect","1. Data architect",{"$f":"IF(D9=\"\",\"No Price\",IF(D9>'Day Rate Minimums & Caps'!$C$4,\"Fail 1\",IF(D9<'Day Rate Minimums & Caps'!$D$4,\"Fail 3\",\"Pass\")))","v":"No Price"},{"$f":"IF(E9=\"\",\"No Price\",IF(E9>'Day Rate Minimums & Caps'!$C$5,\"Fail 1\",IF(E9<'Day Rate Minimums & Caps'!$D$5,\"Fail 3\",\"Pass\")))","v":"No Price"},null,"Data architect","1. Data architect",2.7377521613832854E-2,null,"Data architect","1. Data architect",{"$f":"D9*O9","v":0},{"$f":"E9*O9","v":0}]
[null,null,"2. Senior data architect",null,null,null,null,null,"2. Senior data architect",{"$f":"IF(D10=\"\",\"No Price\",IF(D10>'Day Rate Minimums & Caps'!$C$4,\"Fail 1\",IF(D10<'Day Rate Minimums & Caps'!$D$4,\"Fail 3\",IF(D10<D9,\"Fail 2\",\"Pass\"))))","v":"No Price"},{"$f":"IF(E10=\"\",\"No Price\",IF(E10>'Day Rate Minimums & Caps'!$C$5,\"Fail 1\",IF(E10<'Day Rate Minimums & Caps'!$D$5,\"Fail 3\",IF(E10<E9,\"Fail 2\",\"Pass\"))))","v":"No Price"},null,null,"2. Senior data architect",0.87608069164265123,null,null,"2. Senior data architect",0,0]
[null,null,"3. Chief data architect",null,null,null,null,null,"3. Chief data architect",{"$f":"IF(D11=\"\",\"No Price\",IF(D11>'Day Rate Minimums & Caps'!$C$4,\"Fail 1\",IF(D11<'Day Rate Minimums & Caps'!$D$4,\"Fail 3\",IF(D11<D10,\"Fail 2\",\"Pass\"))))","v":"No Price"},{"$f":"IF(E11=\"\",\"No Price\",IF(E11>'Day Rate Minimums & Caps'!$C$5,\"Fail 1\",IF(E11<'Day Rate Minimums & Caps'!$D$5,\"Fail 3\",IF(E11<E10,\"Fail 2\",\"Pass\"))))","v":"No Price"},null,null,"3. Chief data architect",0.21902017291066284,null,null,"3. Chief data architect",0,0]
[]
[null,"Enterprise architect","1. Enterprise architect",null,null,null,null,"Enterprise architect","1. Enterprise architect",{"$f":"IF(D13=\"\",\"No Price\",IF(D13>'Day Rate Minimums & Caps'!$C$4,\"Fail 1\",IF(D13<'Day Rate Minimums & Caps'!$D$4,\"Fail 3\",\"Pass\")))","v":"No Price"},{"$f":"IF(E13=\"\",\"No Price\",IF(E13>'Day Rate Minimums & Caps'!$C$5,\"Fail 1\",IF(E13<'Day Rate Minimums & Caps'!$D$5,\"Fail 3\",\"Pass\")))","v":"No Price"},null,"Enterprise architect","1. Enterprise architect",6.3291139240506333E-2,null,"Enterprise architect","1. Enterprise architect",{"$f":"D13*O13","v":0},{"$f":"E13*O13","v":0}]
[null,null,"2. Senior enterprise architect",null,null,null,null,null,"2. Senior enterprise architect",{"$f":"IF(D14=\"\",\"No Price\",IF(D14>'Day Rate Minimums & Caps'!$C$4,\"Fail 1\",IF(D14<'Day Rate Minimums & Caps'!$D$4,\"Fail 3\",IF(D14<D13,\"Fail 2\",\"Pass\"))))","v":"No Price"},{"$f":"IF(E14=\"\",\"No Price\",IF(E14>'Day Rate Minimums & Caps'!$C$5,\"Fail 1\",IF(E14<'Day Rate Minimums & Caps'!$D$5,\"Fail 3\",IF(E14<E13,\"Fail 2\",\"Pass\"))))","v":"No Price"},null,null,"2. Senior enterprise architect",6.3291139240506333E-2,null,null,"2. Senior enterprise architect",0,0]
[null,null,"3. Lead enterprise architect",null,null,null,null,null,"3. Lead enterprise architect",{"$f":"IF(D15=\"\",\"No Price\",IF(D15>'Day Rate Minimums & Caps'!$C$4,\"Fail 1\",IF(D15<'Day Rate Minimums & Caps'!$D$4,\"Fail 3\",IF(D15<D14,\"Fail 2\",\"Pass\"))))","v":"No Price"},{"$f":"IF(E15=\"\",\"No Price\",IF(E15>'Day Rate Minimums & Caps'!$C$5,\"Fail 1\",IF(E15<'Day Rate Minimums & Caps'!$D$5,\"Fail 3\",IF(E15<E14,\"Fail 2\",\"Pass\"))))","v":"No Price"},null,null,"3. Lead enterprise architect",6.3291139240506333E-2,null,null,"3. Lead enterprise architect",0,0]
{"$rows_left_out":231}
{"sheet":"Offshore Rate Card","index":4,"n_rows":243,"n_cols":18,"rows_kept":243,"cut":false,"hidden":false,"merged":[[80,1,82,1],[84,1,87,1],[89,1,93,1],[95,1,98,1],[100,1,101,1],[103,1,107,1],[109,1,113,1],[115,1,116,1],[118,1,121,1],[123,1,126,1],[129,1,134,1],[136,1,139,1],[141,1,144,1],[146,1,150,1],[156,1,156,2],[157,1,160,1],[162,1,165,1],[167,1,168,1],[170,1,170,2],[171,1,179,1],[181,1,186,1],[234,1,235,1],[237,1,242,1],[188,1,196,1],[198,1,198,2],[199,1,202,1],[204,1,209,1],[213,1,218,1],[220,1,225,1],[227,1,232,1],[84,7,87,7],[89,7,93,7],[95,7,98,7],[100,7,101,7],[103,7,107,7],[109,7,113,7],[115,7,116,7],[129,7,134,7],[136,7,139,7],[141,7,144,7],[146,7,150,7],[156,7,156,8],[157,7,160,7],[162,7,165,7],[204,7,209,7],[213,7,218,7],[220,7,225,7],[227,7,232,7],[234,7,235,7],[237,7,242,7],[167,7,168,7],[170,7,170,8],[171,7,179,7],[181,7,186,7],[188,7,196,7],[198,7,198,8],[199,7,202,7],[0,1,0,11],[0,15,0,17],[1,15,2,15],[1,16,2,16],[1,17,2,17],[3,1,3,2],[4,1,7,1],[3,7,3,8],[4,7,7,7],[26,7,30,7],[32,7,36,7],[38,7,38,8],[39,7,42,7],[44,7,47,7],[9,1,11,1],[9,7,11,7],[13,1,16,1],[13,7,16,7],[18,7,20,7],[18,1,20,1],[22,1,24,1],[26,1,30,1],[32,1,36,1],[80,7,82,7],[118,7,121,7],[123,7,126,7],[128,1,128,2],[128,7,128,8],[2,1,2,2],[49,7,50,7],[49,1,50,1],[52,1,54,1],[56,1,61,1],[63,1,67,1],[69,1,69,2],[70,1,74,1],[76,1,78,1],[52,7,54,7],[56,7,61,7],[63,7,67,7],[69,7,69,8],[70,7,74,7],[76,7,78,7],[38,1,38,2],[39,1,42,1],[44,1,47,1],[22,7,24,7]]}
[null,"OPTIONAL - NOT EVALUATED\n PLEASE ENSURE ALL PRICES ARE LESS THAN 'THE NATIONAL EQUIVALENT COST PER ROLE?' OR \nYOUR BID WILL BE DEEMED NON COMPLIANT \n*Table 7 will indicate a 'FAIL' if your price is above than the national rate entered",null,null,null,null,null,null,null,null,null,null,null,null,null,"Table 8 - Please enter the location of the offshore rate below the corresponding offshore 1, 2 or 3 below:"]
[null,null,null,null,null,null,null,null,null,null,null,null,null,null,null,"Offshore 1","Offshore 2","Offshore 3"]
[null,"Table 6 - Offshore Rate Card OPTIONAL - enter a price only if you have off shore capability\n",null,null,null,null,null,"Table 7 - Offshore Rate Card validation table - DO NOT AMEND"]
[null,"Architecture roles",null,"Offshore 1 ","Offshore 2","Offshore 3",null,"Architecture roles",null,"Offshore 1","Offshore 2","Offshore 3"]
[null,"Business architect","1. Trainee business architect",null,null,null,null,"Business architect","1. Trainee business architect",{"$f":"IF(D5=\"\",\"No Price\",IF(D5>'UK Rate Card - evaluated'!D4,\"Fail 1\",\"Pass\"))","v":"No Price"},{"$f":"IF(E5=\"\",\"No Price\",IF(E5>'UK Rate Card - evaluated'!D4,\"Fail 1\",\"Pass\"))","v":"No Price"},{"$f":"IF(F5=\"\",\"No Price\",IF(F5>'UK Rate Card - evaluated'!D4,\"Fail 1\",\"Pass\"))","v":"No Price"}]
[null,null,"2. Associate business architect",null,null,null,null,null,"2. Associate business architect",{"$f":"IF(D6=\"\",\"No Price\",IF(D6>'UK Rate Card - evaluated'!D5,\"Fail 1\",\"Pass\"))","v":"No Price"},{"$f":"IF(E6=\"\",\"No Price\",IF(E6>'UK Rate Card - evaluated'!D5,\"Fail 1\",\"Pass\"))","v":"No Price"},{"$f":"IF(F6=\"\",\"No Price\",IF(F6>'UK Rate Card - evaluated'!D5,\"Fail 1\",\"Pass\"))","v":"No Price"}]
[null,null,"3. Business architect",null,null,null,null,null,"3. Business architect",{"$f":"IF(D7=\"\",\"No Price\",IF(D7>'UK Rate Card - evaluated'!D6,\"Fail 1\",\"Pass\"))","v":"No Price"},{"$f":"IF(E7=\"\",\"No Price\",IF(E7>'UK Rate Card - evaluated'!D6,\"Fail 1\",\"Pass\"))","v":"No Price"},{"$f":"IF(F7=\"\",\"No Price\",IF(F7>'UK Rate Card - evaluated'!D6,\"Fail 1\",\"Pass\"))","v":"No Price"}]
[null,null,"4. Lead business architect",null,null,null,null,null,"4. Lead business architect",{"$f":"IF(D8=\"\",\"No Price\",IF(D8>'UK Rate Card - evaluated'!D7,\"Fail 1\",\"Pass\"))","v":"No Price"},{"$f":"IF(E8=\"\",\"No Price\",IF(E8>'UK Rate Card - evaluated'!D7,\"Fail 1\",\"Pass\"))","v":"No Price"},{"$f":"IF(F8=\"\",\"No Price\",IF(F8>'UK Rate Card - evaluated'!D7,\"Fail 1\",\"Pass\"))","v":"No Price"}]
[]
[null,"Data architect","1. Data architect",null,null,null,null,"Data architect","1. Data architect",{"$f":"IF(D10=\"\",\"No Price\",IF(D10>'UK Rate Card - evaluated'!D9,\"Fail 1\",\"Pass\"))","v":"No Price"},{"$f":"IF(E10=\"\",\"No Price\",IF(E10>'UK Rate Card - evaluated'!D9,\"Fail 1\",\"Pass\"))","v":"No Price"},{"$f":"IF(F10=\"\",\"No Price\",IF(F10>'UK Rate Card - evaluated'!D9,\"Fail 1\",\"Pass\"))","v":"No Price"}]
[null,null,"2. Senior data architect",null,null,null,null,null,"2. Senior data architect",{"$f":"IF(D11=\"\",\"No Price\",IF(D11>'UK Rate Card - evaluated'!D10,\"Fail 1\",\"Pass\"))","v":"No Price"},{"$f":"IF(E11=\"\",\"No Price\",IF(E11>'UK Rate Card - evaluated'!D10,\"Fail 1\",\"Pass\"))","v":"No Price"},{"$f":"IF(F11=\"\",\"No Price\",IF(F11>'UK Rate Card - evaluated'!D10,\"Fail 1\",\"Pass\"))","v":"No Price"}]
[null,null,"3. Chief data architect",null,null,null,null,null,"3. Chief data architect",{"$f":"IF(D12=\"\",\"No Price\",IF(D12>'UK Rate Card - evaluated'!D11,\"Fail 1\",\"Pass\"))","v":"No Price"},{"$f":"IF(E12=\"\",\"No Price\",IF(E12>'UK Rate Card - evaluated'!D11,\"Fail 1\",\"Pass\"))","v":"No Price"},{"$f":"IF(F12=\"\",\"No Price\",IF(F12>'UK Rate Card - evaluated'!D11,\"Fail 1\",\"Pass\"))","v":"No Price"}]
[]
[null,"Enterprise architect","1. Enterprise architect",null,null,null,null,"Enterprise architect","1. Enterprise architect",{"$f":"IF(D14=\"\",\"No Price\",IF(D14>'UK Rate Card - evaluated'!D13,\"Fail 1\",\"Pass\"))","v":"No Price"},{"$f":"IF(E14=\"\",\"No Price\",IF(E14>'UK Rate Card - evaluated'!D13,\"Fail 1\",\"Pass\"))","v":"No Price"},{"$f":"IF(F14=\"\",\"No Price\",IF(F14>'UK Rate Card - evaluated'!D13,\"Fail 1\",\"Pass\"))","v":"No Price"}]
[null,null,"2. Senior enterprise architect",null,null,null,null,null,"2. Senior enterprise architect",{"$f":"IF(D15=\"\",\"No Price\",IF(D15>'UK Rate Card - evaluated'!D14,\"Fail 1\",\"Pass\"))","v":"No Price"},{"$f":"IF(E15=\"\",\"No Price\",IF(E15>'UK Rate Card - evaluated'!D14,\"Fail 1\",\"Pass\"))","v":"No Price"},{"$f":"IF(F15=\"\",\"No Price\",IF(F15>'UK Rate Card - evaluated'!D14,\"Fail 1\",\"Pass\"))","v":"No Price"}]
{"$rows_left_out":229}
{"sheet":"EVALUATED","index":5,"n_rows":5,"n_cols":3,"rows_kept":5,"cut":false,"hidden":false,"merged":[]}
[]
[null,"Table 9 - Total price - DO NOT AMEND"]
[]
[null,"Total price from tab 'UK Rate Card':",{"$f":"SUM('UK Rate Card - evaluated'!S244:T244)","v":0}]
[null,"Total for evaluation:",{"$f":"C4/200","v":0}]