{"text_format":"1","workbook":"xlsx","n_sheets":9,"sheets":["Sheet2","Summary","Raw","Step 1 - Full Search","Filter - Duplicate & Expiring","Filter - non relevant ","Step 2 - Filtered (Long List)","Qualify","Step 3 - Qualified"],"not_rendered":{"charts":0,"images":0,"macros":1,"external_links":0,"defined_names":14,"comments":0,"pivot_tables":0},"unopened":[],"bounds":{"document_bytes":16777216,"sheet_cells":100000,"rows_first":2000,"rows_last":500,"rows_between":2000,"halvings":0,"cell_chars":16384,"cell_head_chars":4096},"cells_cut":0,"cells_raw":0,"read":"whole","date_system":"1900"}

{"sheet":"Sheet2","index":0,"n_rows":0,"n_cols":0,"rows_kept":0,"cut":false,"hidden":true,"merged":[]}

{"sheet":"Summary","index":1,"n_rows":22,"n_cols":3,"rows_kept":22,"cut":false,"hidden":false,"merged":[[13,4,13,6],[14,4,18,6]]}
["Search & Selection Summary"]
["Requirement Owner","Stuart Hetherington "]
["Commercial Lead","Cheryl Davies"]
["Latest Cloud Version","G-Cloud 9"]
["USE LATEST PUBLISHED CLOUD VERSION ONLY?","YES"]
["Date Searches Took Place","2018-05-23"]
["Service Title e.g. \"Training Environment\"","Data Centre Management"]
[]
[null,"Searches","Suppliers"]
["Step 1 - Full Search",{"$f":"'Step 1 - Full Search'!I3","v":1},{"$f":"'Step 1 - Full Search'!I2","v":1}]
["MINUS - EXPIRING",{"$f":"'Filter - Duplicate & Expiring'!J2","v":1}]
["MINUS - DUPLICATES",{"$f":"'Filter - Duplicate & Expiring'!J1","v":0}]
["TOTAL Unique",{"$f":"'Filter - Duplicate & Expiring'!L1","v":0},{"$f":"'Filter - non relevant '!H3","v":0}]
["MINUS - Non- Relevant",{"$f":"'Filter - non relevant '!H1","v":0}]
["TOTAL REMAINING",{"$f":"'Filter - non relevant '!J1","v":0},{"$f":"'Step 2 - Filtered (Long List)'!F3","v":1}]
["Step 2 - Filtered"]
["Withdrawn",{"$f":"COUNTIF(Qualify!G6:G31,\"NO\")","v":0}]
["Qualify",{"$f":"COUNTIF(Qualify!F6:F31,\"YES\")","v":1}]
["Step 3 - Qualified",{"$f":"COUNTA('Step 3 - Qualified'!B6:B31)","v":1},{"$f":"'Step 3 - Qualified'!F3","v":1}]
[]
[]
["Any queries please click here"]

{"sheet":"Raw","index":2,"n_rows":19,"n_cols":1,"rows_kept":19,"cut":false,"hidden":false,"merged":[]}
[]
[]
[]
[]
[]
[]
[]
[]
[]
[]
[]
[]
[]
[]
[]
[]
[]
[]
[" PASTE INTO A20"]

{"sheet":"Step 1 - Full Search","index":3,"n_rows":7,"n_cols":11,"rows_kept":7,"cut":false,"hidden":false,"merged":[[3,0,3,1],[3,2,3,3]]}
[null,1,1,1]
[null,"Raw List",{"$f":"Summary!B7","v":"Data Centre Management"},{"$f":"Summary!B6","v":"2018-05-23"},null,null,null,"Total Suppliers",{"$f":"SUM(IF(FREQUENCY(IF(LEN(D7:D7136)>0,MATCH(D7:D7136,D7:D7136,0),\"\"), IF(LEN(D7:D7136)>0,MATCH(D7:D7136,D7:D7136,0),\"\"))>0,1))","v":1},"Total Services",{"$f":"SUM(IF(FREQUENCY(IF(LEN(C7:C7136)>0,MATCH(C7:C7136,C7:C7136,0),\"\"), IF(LEN(C7:C7136)>0,MATCH(C7:C7136,C7:C7136,0),\"\"))>0,1))","v":1}]
["Step 1 - Search",1,1,1,null,null,null,"Total Results",{"$f":"COUNTA(A7:A97135)","v":1}]
["The DMP was searched for all service offerings that included the following keywords/phrases",null,{"$f":"TRIM(ConcatUniq(A7:A7135, \" \"))","v":"Azure, Amazon Web Services, \"Managed Cloud Infrastructure\""}]
[1,1,1,1]
["Search Term","Cloud","Service Title","Supplier","Service ID"]
["Azure, Amazon Web Services, \"Managed Cloud Infrastructure\"",9,"Managed Cloud Infrastructure","Vysiion",913495630981500]

{"sheet":"Filter - Duplicate & Expiring","index":4,"n_rows":1401,"n_cols":12,"rows_kept":1401,"cut":false,"hidden":false,"merged":[[2,1,2,4]]}
[{"$f":"Summary!B4","v":"G-Cloud 9"},null,{"$f":"Summary!B7","v":"Data Centre Management"},null,{"$f":"Summary!B6","v":"2018-05-23"},null,1,null,"Duplicate",{"$f":"COUNTIF(G6:G6856,\"YES\")","v":0},"G5/Unique",{"$f":"COUNTIF(I6:I6856,\"NO\")","v":0}]
[{"$f":"Summary!B5","v":"YES"},null,null,null,null,null,1,null,"G4",{"$f":"COUNTIF(H6:H6856,\"EXPIRING\")","v":1}]
["Step 1 - Search","The DMP Service Titles were reviewed to remove expiring G-Cloud Framework and duplicate services]   [NB: Maximum contract length - 24mths]",null,null,null,null,1,null,null,null,{"$f":"Summary!B5","v":"YES"}]
[1,1,1,null,1,null,1,null,null,1]
["Search Term","Cloud","Service Title","Supplier","Service ID",null,"Duplicate?","Current Cloud?","FILTERED?"]
["Azure, Amazon Web Services, \"Managed Cloud Infrastructure\"",9,"Managed Cloud Infrastructure","Vysiion",913495630981500,null,"N",{"$f":"IF(B6=\"\",\"\", IF(VALUE(LEFT(B6,1))=A$1,\"\",IF(AND(A$2=\"Yes\",VALUE(LEFT(B6))<A$1),\"Expiring\",\"\")))","v":"Expiring"},{"$f":"IF(B6=\"\",\"\",IF(OR(G6=\"YES\",H6=\"EXPIRING\"),\"YES\",\"NO\"))","v":"YES"}]
[null,null,null,null,null,null,{"$f":"IF(E7=\"\",\"\",IF(COUNTIF(E:E,E7)>1,IF(COUNTIF(E$6:E7,E7)=1,\"\",\"YES\"),\"\"))","v":""},"",""]
[null,null,null,null,null,null,{"$f":"IF(E8=\"\",\"\",IF(COUNTIF(E:E,E8)>1,IF(COUNTIF(E$6:E8,E8)=1,\"\",\"YES\"),\"\"))","v":""},"",""]
[null,null,null,null,null,null,{"$f":"IF(E9=\"\",\"\",IF(COUNTIF(E:E,E9)>1,IF(COUNTIF(E$6:E9,E9)=1,\"\",\"YES\"),\"\"))","v":""},"",""]
[null,null,null,null,null,null,{"$f":"IF(E10=\"\",\"\",IF(COUNTIF(E:E,E10)>1,IF(COUNTIF(E$6:E10,E10)=1,\"\",\"YES\"),\"\"))","v":""},"",""]
[null,null,null,null,null,null,{"$f":"IF(E11=\"\",\"\",IF(COUNTIF(E:E,E11)>1,IF(COUNTIF(E$6:E11,E11)=1,\"\",\"YES\"),\"\"))","v":""},"",""]
[null,null,null,null,null,null,{"$f":"IF(E12=\"\",\"\",IF(COUNTIF(E:E,E12)>1,IF(COUNTIF(E$6:E12,E12)=1,\"\",\"YES\"),\"\"))","v":""},"",""]
[null,null,null,null,null,null,{"$f":"IF(E13=\"\",\"\",IF(COUNTIF(E:E,E13)>1,IF(COUNTIF(E$6:E13,E13)=1,\"\",\"YES\"),\"\"))","v":""},"",""]
[null,null,null,null,null,null,{"$f":"IF(E14=\"\",\"\",IF(COUNTIF(E:E,E14)>1,IF(COUNTIF(E$6:E14,E14)=1,\"\",\"YES\"),\"\"))","v":""},"",""]
[null,null,null,null,null,null,{"$f":"IF(E15=\"\",\"\",IF(COUNTIF(E:E,E15)>1,IF(COUNTIF(E$6:E15,E15)=1,\"\",\"YES\"),\"\"))","v":""},"",""]
[null,null,null,null,null,null,{"$f":"IF(E16=\"\",\"\",IF(COUNTIF(E:E,E16)>1,IF(COUNTIF(E$6:E16,E16)=1,\"\",\"YES\"),\"\"))","v":""},"",""]
[null,null,null,null,null,null,{"$f":"IF(E17=\"\",\"\",IF(COUNTIF(E:E,E17)>1,IF(COUNTIF(E$6:E17,E17)=1,\"\",\"YES\"),\"\"))","v":""},"",""]
[null,null,null,null,null,null,{"$f":"IF(E18=\"\",\"\",IF(COUNTIF(E:E,E18)>1,IF(COUNTIF(E$6:E18,E18)=1,\"\",\"YES\"),\"\"))","v":""},"",""]
[null,null,null,null,null,null,{"$f":"IF(E19=\"\",\"\",IF(COUNTIF(E:E,E19)>1,IF(COUNTIF(E$6:E19,E19)=1,\"\",\"YES\"),\"\"))","v":""},"",""]
[null,null,null,null,null,null,{"$f":"IF(E20=\"\",\"\",IF(COUNTIF(E:E,E20)>1,IF(COUNTIF(E$6:E20,E20)=1,\"\",\"YES\"),\"\"))","v":""},"",""]
[null,null,null,null,null,null,{"$f":"IF(E21=\"\",\"\",IF(COUNTIF(E:E,E21)>1,IF(COUNTIF(E$6:E21,E21)=1,\"\",\"YES\"),\"\"))","v":""},"",""]
[null,null,null,null,null,null,{"$f":"IF(E22=\"\",\"\",IF(COUNTIF(E:E,E22)>1,IF(COUNTIF(E$6:E22,E22)=1,\"\",\"YES\"),\"\"))","v":""},"",""]
[null,null,null,null,null,null,{"$f":"IF(E23=\"\",\"\",IF(COUNTIF(E:E,E23)>1,IF(COUNTIF(E$6:E23,E23)=1,\"\",\"YES\"),\"\"))","v":""},"",""]
[null,null,null,null,null,null,{"$f":"IF(E24=\"\",\"\",IF(COUNTIF(E:E,E24)>1,IF(COUNTIF(E$6:E24,E24)=1,\"\",\"YES\"),\"\"))","v":""},"",""]
[null,null,null,null,null,null,{"$f":"IF(E25=\"\",\"\",IF(COUNTIF(E:E,E25)>1,IF(COUNTIF(E$6:E25,E25)=1,\"\",\"YES\"),\"\"))","v":""},"",""]
[null,null,null,null,null,null,{"$f":"IF(E26=\"\",\"\",IF(COUNTIF(E:E,E26)>1,IF(COUNTIF(E$6:E26,E26)=1,\"\",\"YES\"),\"\"))","v":""},"",""]
[null,null,null,null,null,null,{"$f":"IF(E27=\"\",\"\",IF(COUNTIF(E:E,E27)>1,IF(COUNTIF(E$6:E27,E27)=1,\"\",\"YES\"),\"\"))","v":""},"",""]
[null,null,null,null,null,null,{"$f":"IF(E28=\"\",\"\",IF(COUNTIF(E:E,E28)>1,IF(COUNTIF(E$6:E28,E28)=1,\"\",\"YES\"),\"\"))","v":""},"",""]
[null,null,null,null,null,null,{"$f":"IF(E29=\"\",\"\",IF(COUNTIF(E:E,E29)>1,IF(COUNTIF(E$6:E29,E29)=1,\"\",\"YES\"),\"\"))","v":""},{"$f":"IF(B29=\"\",\"\", IF(VALUE(LEFT(B29,1))=A$1,\"\",IF(AND(A$2=\"Yes\",VALUE(LEFT(B29))<A$1),\"Expiring\",\"\")))","v":""},{"$f":"IF(B29=\"\",\"\",IF(OR(G29=\"YES\",H29=\"EXPIRING\"),\"YES\",\"NO\"))","v":""}]
[null,null,null,null,null,null,{"$f":"IF(E30=\"\",\"\",IF(COUNTIF(E:E,E30)>1,IF(COUNTIF(E$6:E30,E30)=1,\"\",\"YES\"),\"\"))","v":""},"",""]
[null,null,null,null,null,null,{"$f":"IF(E31=\"\",\"\",IF(COUNTIF(E:E,E31)>1,IF(COUNTIF(E$6:E31,E31)=1,\"\",\"YES\"),\"\"))","v":""},"",""]
[null,null,null,null,null,null,{"$f":"IF(E32=\"\",\"\",IF(COUNTIF(E:E,E32)>1,IF(COUNTIF(E$6:E32,E32)=1,\"\",\"YES\"),\"\"))","v":""},"",""]
[null,null,null,null,null,null,{"$f":"IF(E33=\"\",\"\",IF(COUNTIF(E:E,E33)>1,IF(COUNTIF(E$6:E33,E33)=1,\"\",\"YES\"),\"\"))","v":""},"",""]
[null,null,null,null,null,null,{"$f":"IF(E34=\"\",\"\",IF(COUNTIF(E:E,E34)>1,IF(COUNTIF(E$6:E34,E34)=1,\"\",\"YES\"),\"\"))","v":""},"",""]
[null,null,null,null,null,null,{"$f":"IF(E35=\"\",\"\",IF(COUNTIF(E:E,E35)>1,IF(COUNTIF(E$6:E35,E35)=1,\"\",\"YES\"),\"\"))","v":""},"",""]
[null,null,null,null,null,null,{"$f":"IF(E36=\"\",\"\",IF(COUNTIF(E:E,E36)>1,IF(COUNTIF(E$6:E36,E36)=1,\"\",\"YES\"),\"\"))","v":""},"",""]
[null,null,null,null,null,null,{"$f":"IF(E37=\"\",\"\",IF(COUNTIF(E:E,E37)>1,IF(COUNTIF(E$6:E37,E37)=1,\"\",\"YES\"),\"\"))","v":""},"",""]
[null,null,null,null,null,null,{"$f":"IF(E38=\"\",\"\",IF(COUNTIF(E:E,E38)>1,IF(COUNTIF(E$6:E38,E38)=1,\"\",\"YES\"),\"\"))","v":""},"",""]
[null,null,null,null,null,null,{"$f":"IF(E39=\"\",\"\",IF(COUNTIF(E:E,E39)>1,IF(COUNTIF(E$6:E39,E39)=1,\"\",\"YES\"),\"\"))","v":""},"",""]
[null,null,null,null,null,null,{"$f":"IF(E40=\"\",\"\",IF(COUNTIF(E:E,E40)>1,IF(COUNTIF(E$6:E40,E40)=1,\"\",\"YES\"),\"\"))","v":""},"",""]
[null,null,null,null,null,null,{"$f":"IF(E41=\"\",\"\",IF(COUNTIF(E:E,E41)>1,IF(COUNTIF(E$6:E41,E41)=1,\"\",\"YES\"),\"\"))","v":""},"",""]
[null,null,null,null,null,null,{"$f":"IF(E42=\"\",\"\",IF(COUNTIF(E:E,E42)>1,IF(COUNTIF(E$6:E42,E42)=1,\"\",\"YES\"),\"\"))","v":""},"",""]
[null,null,null,null,null,null,{"$f":"IF(E43=\"\",\"\",IF(COUNTIF(E:E,E43)>1,IF(COUNTIF(E$6:E43,E43)=1,\"\",\"YES\"),\"\"))","v":""},"",""]
[null,null,null,null,null,null,{"$f":"IF(E44=\"\",\"\",IF(COUNTIF(E:E,E44)>1,IF(COUNTIF(E$6:E44,E44)=1,\"\",\"YES\"),\"\"))","v":""},"",""]
[null,null,null,null,null,null,{"$f":"IF(E45=\"\",\"\",IF(COUNTIF(E:E,E45)>1,IF(COUNTIF(E$6:E45,E45)=1,\"\",\"YES\"),\"\"))","v":""},"",""]
[null,null,null,null,null,null,{"$f":"IF(E46=\"\",\"\",IF(COUNTIF(E:E,E46)>1,IF(COUNTIF(E$6:E46,E46)=1,\"\",\"YES\"),\"\"))","v":""},"",""]
[null,null,null,null,null,null,{"$f":"IF(E47=\"\",\"\",IF(COUNTIF(E:E,E47)>1,IF(COUNTIF(E$6:E47,E47)=1,\"\",\"YES\"),\"\"))","v":""},"",""]
[null,null,null,null,null,null,{"$f":"IF(E48=\"\",\"\",IF(COUNTIF(E:E,E48)>1,IF(COUNTIF(E$6:E48,E48)=1,\"\",\"YES\"),\"\"))","v":""},"",""]
[null,null,null,null,null,null,{"$f":"IF(E49=\"\",\"\",IF(COUNTIF(E:E,E49)>1,IF(COUNTIF(E$6:E49,E49)=1,\"\",\"YES\"),\"\"))","v":""},"",""]
[null,null,null,null,null,null,{"$f":"IF(E50=\"\",\"\",IF(COUNTIF(E:E,E50)>1,IF(COUNTIF(E$6:E50,E50)=1,\"\",\"YES\"),\"\"))","v":""},"",""]
[null,null,null,null,null,null,{"$f":"IF(E51=\"\",\"\",IF(COUNTIF(E:E,E51)>1,IF(COUNTIF(E$6:E51,E51)=1,\"\",\"YES\"),\"\"))","v":""},"",""]
[null,null,null,null,null,null,{"$f":"IF(E52=\"\",\"\",IF(COUNTIF(E:E,E52)>1,IF(COUNTIF(E$6:E52,E52)=1,\"\",\"YES\"),\"\"))","v":""},"",""]
[null,null,null,null,null,null,{"$f":"IF(E53=\"\",\"\",IF(COUNTIF(E:E,E53)>1,IF(COUNTIF(E$6:E53,E53)=1,\"\",\"YES\"),\"\"))","v":""},"",""]
[null,null,null,null,null,null,{"$f":"IF(E54=\"\",\"\",IF(COUNTIF(E:E,E54)>1,IF(COUNTIF(E$6:E54,E54)=1,\"\",\"YES\"),\"\"))","v":""},"",""]
[null,null,null,null,null,null,{"$f":"IF(E55=\"\",\"\",IF(COUNTIF(E:E,E55)>1,IF(COUNTIF(E$6:E55,E55)=1,\"\",\"YES\"),\"\"))","v":""},"",""]
[null,null,null,null,null,null,{"$f":"IF(E56=\"\",\"\",IF(COUNTIF(E:E,E56)>1,IF(COUNTIF(E$6:E56,E56)=1,\"\",\"YES\"),\"\"))","v":""},"",""]
[null,null,null,null,null,null,{"$f":"IF(E57=\"\",\"\",IF(COUNTIF(E:E,E57)>1,IF(COUNTIF(E$6:E57,E57)=1,\"\",\"YES\"),\"\"))","v":""},"",""]
[null,null,null,null,null,null,{"$f":"IF(E58=\"\",\"\",IF(COUNTIF(E:E,E58)>1,IF(COUNTIF(E$6:E58,E58)=1,\"\",\"YES\"),\"\"))","v":""},"",""]
[null,null,null,null,null,null,{"$f":"IF(E59=\"\",\"\",IF(COUNTIF(E:E,E59)>1,IF(COUNTIF(E$6:E59,E59)=1,\"\",\"YES\"),\"\"))","v":""},"",""]
[null,null,null,null,null,null,{"$f":"IF(E60=\"\",\"\",IF(COUNTIF(E:E,E60)>1,IF(COUNTIF(E$6:E60,E60)=1,\"\",\"YES\"),\"\"))","v":""},"",""]
[null,null,null,null,null,null,{"$f":"IF(E61=\"\",\"\",IF(COUNTIF(E:E,E61)>1,IF(COUNTIF(E$6:E61,E61)=1,\"\",\"YES\"),\"\"))","v":""},{"$f":"IF(B61=\"\",\"\", IF(VALUE(LEFT(B61,1))=A$1,\"\",IF(AND(A$2=\"Yes\",VALUE(LEFT(B61))<A$1),\"Expiring\",\"\")))","v":""},{"$f":"IF(B61=\"\",\"\",IF(OR(G61=\"YES\",H61=\"EXPIRING\"),\"YES\",\"NO\"))","v":""}]
[null,null,null,null,null,null,{"$f":"IF(E62=\"\",\"\",IF(COUNTIF(E:E,E62)>1,IF(COUNTIF(E$6:E62,E62)=1,\"\",\"YES\"),\"\"))","v":""},"",""]
[null,null,null,null,null,null,{"$f":"IF(E63=\"\",\"\",IF(COUNTIF(E:E,E63)>1,IF(COUNTIF(E$6:E63,E63)=1,\"\",\"YES\"),\"\"))","v":""},"",""]
[null,null,null,null,null,null,{"$f":"IF(E64=\"\",\"\",IF(COUNTIF(E:E,E64)>1,IF(COUNTIF(E$6:E64,E64)=1,\"\",\"YES\"),\"\"))","v":""},"",""]
[null,null,null,null,null,null,{"$f":"IF(E65=\"\",\"\",IF(COUNTIF(E:E,E65)>1,IF(COUNTIF(E$6:E65,E65)=1,\"\",\"YES\"),\"\"))","v":""},"",""]
[null,null,null,null,null,null,{"$f":"IF(E66=\"\",\"\",IF(COUNTIF(E:E,E66)>1,IF(COUNTIF(E$6:E66,E66)=1,\"\",\"YES\"),\"\"))","v":""},"",""]
[null,null,null,null,null,null,{"$f":"IF(E67=\"\",\"\",IF(COUNTIF(E:E,E67)>1,IF(COUNTIF(E$6:E67,E67)=1,\"\",\"YES\"),\"\"))","v":""},"",""]
[null,null,null,null,null,null,{"$f":"IF(E68=\"\",\"\",IF(COUNTIF(E:E,E68)>1,IF(COUNTIF(E$6:E68,E68)=1,\"\",\"YES\"),\"\"))","v":""},"",""]
[null,null,null,null,null,null,{"$f":"IF(E69=\"\",\"\",IF(COUNTIF(E:E,E69)>1,IF(COUNTIF(E$6:E69,E69)=1,\"\",\"YES\"),\"\"))","v":""},"",""]
[null,null,null,null,null,null,{"$f":"IF(E70=\"\",\"\",IF(COUNTIF(E:E,E70)>1,IF(COUNTIF(E$6:E70,E70)=1,\"\",\"YES\"),\"\"))","v":""},"",""]
[null,null,null,null,null,null,{"$f":"IF(E71=\"\",\"\",IF(COUNTIF(E:E,E71)>1,IF(COUNTIF(E$6:E71,E71)=1,\"\",\"YES\"),\"\"))","v":""},"",""]
[null,null,null,null,null,null,{"$f":"IF(E72=\"\",\"\",IF(COUNTIF(E:E,E72)>1,IF(COUNTIF(E$6:E72,E72)=1,\"\",\"YES\"),\"\"))","v":""},"",""]
[null,null,null,null,null,null,{"$f":"IF(E73=\"\",\"\",IF(COUNTIF(E:E,E73)>1,IF(COUNTIF(E$6:E73,E73)=1,\"\",\"YES\"),\"\"))","v":""},"",""]
[null,null,null,null,null,null,{"$f":"IF(E74=\"\",\"\",IF(COUNTIF(E:E,E74)>1,IF(COUNTIF(E$6:E74,E74)=1,\"\",\"YES\"),\"\"))","v":""},"",""]
[null,null,null,null,null,null,{"$f":"IF(E75=\"\",\"\",IF(COUNTIF(E:E,E75)>1,IF(COUNTIF(E$6:E75,E75)=1,\"\",\"YES\"),\"\"))","v":""},"",""]
[null,null,null,null,null,null,{"$f":"IF(E76=\"\",\"\",IF(COUNTIF(E:E,E76)>1,IF(COUNTIF(E$6:E76,E76)=1,\"\",\"YES\"),\"\"))","v":""},"",""]
[null,null,null,null,null,null,{"$f":"IF(E77=\"\",\"\",IF(COUNTIF(E:E,E77)>1,IF(COUNTIF(E$6:E77,E77)=1,\"\",\"YES\"),\"\"))","v":""},"",""]
[null,null,null,null,null,null,{"$f":"IF(E78=\"\",\"\",IF(COUNTIF(E:E,E78)>1,IF(COUNTIF(E$6:E78,E78)=1,\"\",\"YES\"),\"\"))","v":""},"",""]
[null,null,null,null,null,null,{"$f":"IF(E79=\"\",\"\",IF(COUNTIF(E:E,E79)>1,IF(COUNTIF(E$6:E79,E79)=1,\"\",\"YES\"),\"\"))","v":""},"",""]
[null,null,null,null,null,null,{"$f":"IF(E80=\"\",\"\",IF(COUNTIF(E:E,E80)>1,IF(COUNTIF(E$6:E80,E80)=1,\"\",\"YES\"),\"\"))","v":""},"",""]
{"$rows_left_out":1322}
{"sheet":"Filter - non relevant ","index":5,"n_rows":6,"n_cols":10,"rows_kept":6,"cut":false,"hidden":false,"merged":[[2,1,2,4]]}
[1,1,{"$f":"Summary!B7","v":"Data Centre Management"},null,{"$f":"Summary!B6","v":"2018-05-23"},null,"Non Relevant",{"$f":"COUNTIF(F6:F9944,\"NO\")","v":0},"Relevant",{"$f":"COUNTIF(F6:F9944,\"YES\")","v":0}]
[1,1]
["Filter 2",null,null,null,null,null,"Suppliers",{"$f":"SUM(IF(FREQUENCY(IF(LEN(D7:D9944)>0,MATCH(D7:D9944,D7:D9944,0),\"\"), IF(LEN(D7:D9944)>0,MATCH(D7:D9944,D7:D9944,0),\"\"))>0,1))","v":0},"Services",{"$f":"SUM(IF(FREQUENCY(IF(LEN(C7:C9944)>0,MATCH(C7:C9944,C7:C9944,0),\"\"), IF(LEN(C7:C9944)>0,MATCH(C7:C9944,C7:C9944,0),\"\"))>0,1))","v":0}]
[1,1,1,null,1,1,1,1,1,1]
["Search Term","Cloud","Service Title","Supplier","Service ID","Relevant?","Rationale"]
["Search Term","Cloud","Service Title","Supplier","Service ID"]

{"sheet":"Step 2 - Filtered (Long List)","index":6,"n_rows":6,"n_cols":6,"rows_kept":6,"cut":false,"hidden":false,"merged":[[2,1,2,4]]}
["Step 2 - Filtered (Long List)","Long list",{"$f":"Summary!B7","v":"Data Centre Management"},null,{"$f":"Summary!B6","v":"2018-05-23"}]
[1,1,1]
["Step 2 - Filtered","The services that form the Long List",null,null,null,{"$f":"SUM(IF(FREQUENCY(IF(LEN(E6:E9998)>0,MATCH(E6:E9998,E6:E9998,0),\"\"), IF(LEN(E6:E9998)>0,MATCH(E6:E9998,E6:E9998,0),\"\"))>0,1))","v":1}]
[1,1,1]
["Search Term","Cloud","Service Title","Supplier","Service ID"]
["Azure, Amazon Web Services, \"Managed Cloud Infrastructure\"",9,"Managed Cloud Infrastructure","Vysiion",913495630981500]

{"sheet":"Qualify","index":7,"n_rows":797,"n_cols":16,"rows_kept":797,"cut":false,"hidden":false,"merged":[[2,0,2,1],[2,2,2,7],[3,7,3,13],[3,5,3,6]]}
[11,"Long list",{"$f":"Summary!B7","v":"Data Centre Management"},null,{"$f":"Summary!B6","v":"2018-05-23"},null,null,"Withdrawn?",{"$f":"COUNTIF(G6:G91,\"NO\")","v":0}]
[1]
["Qualify;Confirmed if service offered via the DMP, under G-Cloud, meets our technical, financial & legal checks, including key service criteria;",null,{"$f":"TRIM(ConcatUniq(H5:N5, \" \"))","v":""}]
[1,null,null,null,null,null,null,"TECHINICAL KNOCKOUTS"]
["Search Term","Cloud","Service Title","Supplier","Service ID","Qualified?","Replied?",null,null,null,null,null,null,null,"FVRA","Ts&Cs Review"]
["Azure, Amazon Web Services, \"Managed Cloud Infrastructure\"",9,"Managed Cloud Infrastructure","Vysiion",913495630981500,{"$f":"IF(C6=\"\",\"\",IF(COUNT(MATCH(\"NO\",G6:N6,0)),\"NO\",\"YES\"))","v":"YES"},"Yes"]
[null,null,null,null,null,""]
[null,null,null,null,null,""]
[null,null,null,null,null,""]
[null,null,null,null,null,""]
[null,null,null,null,null,""]
[null,null,null,null,null,""]
[null,null,null,null,null,""]
[null,null,null,null,null,""]
[null,null,null,null,null,""]
[null,null,null,null,null,""]
[null,null,null,null,null,{"$f":"IF(C17=\"\",\"\",IF(COUNT(MATCH(\"NO\",G17:N17,0)),\"NO\",\"YES\"))","v":""}]
[null,null,null,null,null,""]
[null,null,null,null,null,""]
[null,null,null,null,null,""]
[null,null,null,null,null,""]
[null,null,null,null,null,""]
[null,null,null,null,null,""]
[null,null,null,null,null,""]
[null,null,null,null,null,""]
[null,null,null,null,null,""]
[null,null,null,null,null,""]
[null,null,null,null,null,""]
[null,null,null,null,null,""]
[null,null,null,null,null,""]
[null,null,null,null,null,""]
[null,null,null,null,null,""]
[null,null,null,null,null,""]
[null,null,null,null,null,""]
[null,null,null,null,null,""]
[null,null,null,null,null,""]
[null,null,null,null,null,""]
[null,null,null,null,null,""]
[null,null,null,null,null,""]
[null,null,null,null,null,""]
[null,null,null,null,null,""]
[null,null,null,null,null,""]
[null,null,null,null,null,""]
[null,null,null,null,null,""]
[null,null,null,null,null,""]
[null,null,null,null,null,""]
[null,null,null,null,null,""]
[null,null,null,null,null,""]
[null,null,null,null,null,""]
[null,null,null,null,null,""]
[null,null,null,null,null,""]
[null,null,null,null,null,""]
[null,null,null,null,null,""]
[null,null,null,null,null,""]
[null,null,null,null,null,""]
[null,null,null,null,null,""]
[null,null,null,null,null,""]
[null,null,null,null,null,""]
[null,null,null,null,null,""]
[null,null,null,null,null,""]
[null,null,null,null,null,{"$f":"IF(C61=\"\",\"\",IF(COUNT(MATCH(\"NO\",G61:N61,0)),\"NO\",\"YES\"))","v":""}]
[null,null,null,null,null,""]
[null,null,null,null,null,""]
[null,null,null,null,null,""]
[null,null,null,null,null,""]
[null,null,null,null,null,""]
[null,null,null,null,null,""]
[null,null,null,null,null,""]
[null,null,null,null,null,""]
[null,null,null,null,null,""]
[null,null,null,null,null,""]
[null,null,null,null,null,""]
[null,null,null,null,null,""]
[null,null,null,null,null,""]
[null,null,null,null,null,""]
[null,null,null,null,null,""]
[null,null,null,null,null,""]
[null,null,null,null,null,""]
[null,null,null,null,null,""]
[null,null,null,null,null,""]
{"$rows_left_out":718}
{"sheet":"Step 3 - Qualified","index":8,"n_rows":6,"n_cols":7,"rows_kept":6,"cut":false,"hidden":false,"merged":[[2,1,2,4]]}
[null,"Qualified List",{"$f":"Summary!B7","v":"Data Centre Management"},null,{"$f":"Summary!B6","v":"2018-05-23"}]
[null,1,1,null,1]
["Step 3 - Qualified",1,null,null,null,{"$f":"SUM(IF(FREQUENCY(IF(LEN(E6:E100)>0,MATCH(E6:E100,E6:E100,0),\"\"), IF(LEN(E6:E100)>0,MATCH(E6:E100,E6:E100,0),\"\"))>0,1))","v":1},{"$f":"SUM(IF(FREQUENCY(IF(LEN(E6:E1001)>0,MATCH(E6:E1001,E6:E1001,0),\"\"), IF(LEN(E6:E1001)>0,MATCH(E6:E1001,E6:E1001,0),\"\"))>0,1))","v":1}]
[1,1]
[2,"Cloud","Service Name","Supplier","Service ID"]
[null,9,"Managed Cloud Infrastructure","Vysiion",913495630981500]