{"text_format":"1","workbook":"xlsx","n_sheets":6,"sheets":["EOI Initial","EOI Final","Declaration","SME Guidance","SIC","Sheet1"],"not_rendered":{"charts":0,"images":1,"macros":1,"external_links":0,"defined_names":120,"comments":0,"pivot_tables":0},"unopened":[],"bounds":{"document_bytes":16777216,"sheet_cells":100000,"rows_first":2000,"rows_last":500,"rows_between":2000,"halvings":0,"cell_chars":16384,"cell_head_chars":4096},"cells_cut":0,"cells_raw":0,"read":"whole","date_system":"1900"}

{"sheet":"EOI Initial","index":0,"n_rows":55,"n_cols":9,"rows_kept":55,"cut":false,"hidden":false,"merged":[[31,4,31,5],[29,0,29,2],[29,4,29,5],[53,0,53,6],[54,0,54,6],[5,4,5,6],[17,4,17,6],[18,0,18,3],[18,4,18,6],[42,5,42,6],[42,0,42,3],[52,0,52,6],[7,4,7,6],[8,4,8,6],[9,4,9,6],[10,4,10,6],[11,0,11,3],[11,4,11,6],[5,0,5,3],[0,0,0,6],[1,0,1,6],[12,0,12,2],[12,4,12,6],[13,0,16,2],[13,4,13,6],[14,4,14,6],[15,4,15,6],[16,4,16,6],[2,0,2,6],[3,0,3,6],[4,0,4,3],[4,4,4,6],[6,0,6,2],[6,4,6,6],[7,0,10,2],[17,0,17,3],[19,0,19,3],[19,4,19,6],[38,4,38,6],[33,0,33,5],[34,0,34,1],[34,5,34,6],[20,0,20,3],[20,4,20,6],[21,0,21,3],[21,4,21,6],[22,0,22,3],[22,4,22,6],[23,0,23,3],[23,4,23,6],[24,0,24,3],[24,4,24,6],[25,0,25,3],[25,4,25,6],[35,0,35,1],[35,2,35,6],[34,2,34,4],[27,0,27,2],[32,0,32,2],[30,0,30,2],[31,0,31,2],[26,0,26,6],[27,4,27,5],[32,4,32,5],[28,0,28,2],[28,4,28,5],[30,4,30,5],[39,0,39,3],[39,4,39,6],[36,0,36,3],[36,4,36,6],[37,2,37,3],[38,0,38,3],[50,0,50,6],[40,5,40,6],[48,0,48,6],[49,0,49,6],[51,0,51,6],[44,0,44,6],[45,0,45,6],[46,0,46,6],[47,0,47,6],[41,0,41,1],[40,0,40,3],[43,0,43,6]]}
[null,null,null,null,null,null,null,null,"Comment"]
["Expression of Interest - AeroSpace Cornwall 2.0"]
["This is to ensure that you receive the very best and most relevant service from the business/organisation support network in Cornwall and that you do not have to repeatedly provide the same basic information to each business/organisation support service provider.",null,null,null,null,null,null,0]
["Initial Eligibility Check",null,null,null,null,null,null,0]
["Trading name ",null,null,null,null,null,null,{"$f":"#REF!","v":{"$error":"#REF!"}}]
["Organisation/Legal name if different from trading name",null,null,null,null,null,null,{"$f":"#REF!","v":{"$error":"#REF!"}}]
["Correspondence/operating address ",null,null,"Line 1",null,null,null,{"$f":"#REF!","v":{"$error":"#REF!"}}]
[null,null,null,"Line 2",null,null,null,{"$f":"#REF!","v":{"$error":"#REF!"}}]
[null,null,null,"Town",null,null,null,{"$f":"#REF!","v":{"$error":"#REF!"}}]
[null,null,null,"County",null,null,null,{"$f":"#REF!","v":{"$error":"#REF!"}}]
[null,null,null,"Postcode",null,null,null,{"$f":"#REF!","v":{"$error":"#REF!"}}]
["Is this address also your registered address",null,null,null,null,null,null,{"$f":"#REF!","v":{"$error":"#REF!"}}]
["Registered address ",null,null,"Line 1",null,null,null,{"$f":"#REF!","v":{"$error":"#REF!"}},"Companies House"]
[null,null,null,"Line 2",null,null,null,{"$f":"#REF!","v":{"$error":"#REF!"}}]
[null,null,null,"Town",null,null,null,{"$f":"#REF!","v":{"$error":"#REF!"}}]
[null,null,null,"County",null,null,null,{"$f":"#REF!&\":\"&#REF!","v":{"$error":"#REF!"}}]
[null,null,null,"Postcode",null,null,null,{"$f":"#REF!&\":\"&#REF!","v":{"$error":"#REF!"}}]
["Contact telephone number (without spaces)"]
["Contact email address"]
["Web address"]
["Type of business/organisation",null,null,null,"Please Select",null,null,{"$f":"#REF!&\":\"&#REF!","v":{"$error":"#REF!"}}]
["Other"]
["Companies House Registration number (if applicable)"]
["Date of registration or incorporation:"]
["If you are a partnership please select from these options",null,null,null,null,null,null,{"$f":"#REF!&\":\"&#REF!","v":{"$error":"#REF!"}}]
["If ‘other’ please specify:"]
["Shareholders: Please provide details of the shareholders of your company - name and % share allocation. Do you have any of the sharehoders have shares in any other companies?  On rare occasions other shareholdings can tip the overall size of business into the non-SME category under EU classification"]
["Name",null,null,"Percentage","Name of the company they own other shares in",null,"Percentage"]
[]
[]
[]
[]
[]
["What is your company SIC code (as per your Companies House entry).  If you do not have a SIC code, Sole Traders for example, please enter one based on the list supplied in the SIC Tab",null,null,null,null,null,null,{"$f":"#REF!","v":{"$error":"#REF!"}}]
["Business sector",null,{"$f":"IFERROR(VLOOKUP(G34,SIC!$A$2:$C$805,2,FALSE),\"\")","v":""},null,null,{"$f":"IFERROR(VLOOKUP(G34,SIC!$A$2:D$805,4,FALSE),\"\")","v":""},null,{"$f":"C35","v":""}]
["Business Description",null,{"$f":"IFERROR(VLOOKUP(G34,SIC!$A$2:$C$805,3,FALSE),\"\")","v":""},null,null,null,null,{"$f":"#REF!","v":{"$error":"#REF!"}}]
["SME Check completed:",null,null,null,"Please select",null,null,null,"See SME guidance"]
[" FY END",null,"Last Accounts",null,null,"Draft Accounts",null,null,"Draft accounts are required if the last accounts are older than 15 months"]
["Share Capital ",null,null,null,null,null,null,null,"From Balance Sheet"]
["Shareholders' or Member's funds /Profit and loss account",null,null,null,null,null,null,null,"From Balance Sheet, Shareholder funds plus any share premium amount"]
{"$rows_left_out":16}
{"sheet":"EOI Final","index":1,"n_rows":30,"n_cols":7,"rows_kept":30,"cut":false,"hidden":false,"merged":[[29,0,29,1],[22,0,22,6],[23,0,23,6],[2,4,2,6],[25,0,25,2],[25,4,25,5],[26,0,26,2],[26,4,26,5],[28,0,28,6],[5,0,5,5],[6,0,6,5],[12,4,12,5],[4,0,4,2],[4,4,4,5],[14,4,14,5],[24,0,24,6],[0,0,0,6],[3,4,3,6],[2,0,2,3],[3,0,3,3],[1,0,1,6],[19,4,19,5],[7,0,7,6],[17,0,17,5],[16,4,16,5],[27,0,27,6],[20,0,20,6],[21,0,21,6],[19,0,19,2],[18,0,18,6],[15,4,15,5],[11,3,11,5],[12,0,12,2],[13,0,13,2],[13,4,13,5]]}
[]
["Final Eligibility Check - AeroSpace Cornwall 2.0"]
["Number of  full time employees (i.e. work a minimum of 36 hours a week)"]
["Number of  part time employees (i.e. work less than a minimum of 36 hours a week)"]
["Are you VAT Registered?",null,null,"Select option","If Yes please provide VAT Number:"]
["Annual R&D spend in last complete financial year (£)"]
["Number of product and process innovations in last three financial years"]
["How many of your current workforce fall into the following equality categories?"]
["Age ","16-24",null,"25-29",null,"30-34"]
[null,"35-39",null,"40-44",null,"45-49"]
[null,"50-54",null,"55-59",null,"60-64"]
[null,"65+",null,"Prefer not to say"]
["Female",null,null,null,"Male"]
["Ethnic grouping",null,null,null,"Select option"]
[null,null,null,null,"Select option"]
[null,null,null,null,"Select option"]
[null,null,null,null,"Select option"]
["Disability (physical, learning, mental health condition)"]
["Does your business/organisation hold the following current policies? They must be signed and dated within the last 12 months"]
["Environmental/Sustainability Development",null,null,null,"Equal Opportunities/Equality and Diversity "]
["As a requirement of the funding, applicants are required to show that they are actively taking responsibility for their project and the effects it may have. For ERDF you must have policies that address Environmental and Sustainability Development and Equality and Diversity; please confirm that you have these policies or that they will be in place if you submit a full application. (They must be signed and dated within the last 12 months)."]
["Samples of both policy documents and useful links can be found at:  https://www.ciosgrowthhub.com/"]
["Environment and Sustainability:  https://www.ciosgrowthhub.com/skills-toolkit/environment-and-sustainability/"]
["Equality and Diversity: https://www.ciosgrowthhub.com/skills-toolkit/equality-and-diversity/"]
["Have any of the business principals been:"]
["disqualified as director?",null,null,"Select option","listed on the individual insolvency register?",null,"Select option"]
["subject to bankruptcy proceedings?",null,null,"Select option","subject to a county court judgement?",null,"Select option"]
["If you answer ‘yes’ to any part of this question please provide details below."]
[]
[{"$f":"NOW()","v":"2020-05-14T11:15:13.570"}]

{"sheet":"Declaration","index":2,"n_rows":28,"n_cols":7,"rows_kept":28,"cut":false,"hidden":false,"merged":[[15,7,19,7],[15,0,15,6],[16,0,16,6],[17,0,17,2],[10,0,10,4],[0,0,0,6],[1,0,1,6],[14,0,14,6],[2,0,2,6],[3,0,3,6],[5,0,5,4],[6,0,6,5],[9,0,9,4],[12,0,12,6],[13,0,13,6],[27,0,27,2],[27,3,27,6],[26,0,26,2],[26,3,26,6],[22,0,22,6],[24,0,24,2],[24,3,24,6],[25,0,25,2],[25,3,25,6],[20,0,20,6],[21,0,21,6],[23,0,23,6],[18,0,18,2],[19,0,19,2]]}
[]
["Self Declaration - AeroSpace Cornwall 2.0"]
["SME declaration (see SME Guidance):"]
["1 confirm that as the applicant organisation I am compliant with:"]
["SMALL"]
["I have a headcount of fewer than 50 employees; ",null,null,null,null,null,"Select option"]
["I have a turnover in the last full financial year of €10m or less;           ",null,null,null,null,null,"Select option"]
[null,null,"OR"]
["MEDIUM"]
["I have a headcount of fewer than 250 employees; ",null,null,null,null,null,"Select option"]
["I have a turnover in the last full financial year of €50m or less;",null,null,null,null,null,"Select option"]
["I have a balance sheet in the last full financial year of €43m or less; ",null,null,null,null,null,"Select option"]
["Only for enterprises trading for at least 3 years: Undertaking in difficulty declaration "]
["I, the undersigned, declare that my organisation is not in difficulty in the meaning of the ETC Regulation (Regulation (EU) No. 1299/2013, Art. 1(3) and the European Regional Development Fund (ERDF) Regulation (Regulation (EU) No. 1301/2013, Art. 3(3)).  \n"]
["State Aid declaration - de minimis"]
["Under European Commission regulation 1407/2013 (de minimis aid regulation), the  European Commission rules prohibit any undertaking from receiving more than €200,000 euros de minimis aid over a rolling three-year period. Any de minimis aid granted over the €200,000 limit may be subject to repayment with interest. Potentially any assistance you may have received from a public body might be a de minimis aid.  This could be from central, regional, devolved governments or agencies or a local council. If you have received any de minimis aid over the last three years (from any source) please provide theh details of the dates and amounts of aid received below."]
["Declaration - I declare that the amount of ‘De Minimis’ aid received by the company/organisation and any linked company/organisation over the last three rolling years is:"]
[null,null,null,"Year 1","Year 2","Year 3","Total"]
["Specify period (this will update when you complete the Date Field at the end of the application)",null,null,{"$f":"IFERROR(TEXT(EDATE(D28,-35),\"mmm-yy\")&\"-\"&TEXT(EDATE(D28,-24),\"mmm-yy\"),\"\")","v":""},{"$f":"IFERROR(TEXT(EDATE(D28,-23),\"mmm-yy\")&\"-\"&TEXT(EDATE(D28,-12),\"mmm-yy\"),\"\")","v":""},{"$f":"IFERROR(TEXT(EDATE(D28,-11),\"mmm-yy\")&\" - \"&TEXT(D28,\"mmm-yy\"),\"\")","v":""}]
["Value of aid received",null,null,0,0,0,{"$f":"D20+E20+F20","v":0}]
["Need for grant declaration"]
["ERDF is a fund of last resort. Notwithstanding my requirement for retaining operating capital and company policy, I have considered other funding sources and I have been either unsuccessful or ineligible.  The AeroSpace Cornwall grant is the most appropriate fund to meet my gap funding requirement.\n"]
["Applicant declaration:"]
["I accept and acknowledge, by typing my name below I am certifying that all information provided within this document and any supporting AeroSpace Cornwall documents I have provided are correct.  "]
["Name:"]
["Position:"]
["Organisation:"]
["Date:"]

{"sheet":"SME Guidance","index":3,"n_rows":30,"n_cols":7,"rows_kept":30,"cut":false,"hidden":false,"merged":[[0,0,0,7],[6,0,6,7],[1,0,1,7],[2,0,2,7],[3,0,3,7],[4,0,4,7],[5,0,5,7],[7,0,7,7],[8,0,8,7],[9,0,9,1],[9,2,9,3],[9,4,9,5],[9,6,9,7],[10,0,10,1],[10,2,10,3],[10,4,10,7],[11,0,11,1],[11,2,11,3],[11,4,11,7],[19,0,19,7],[12,0,12,1],[12,2,12,3],[12,4,12,7],[13,0,13,1],[13,2,13,3],[13,4,13,7],[14,0,14,7],[15,0,15,7],[16,0,16,7],[17,0,17,7],[18,0,18,7],[26,0,26,7],[27,0,27,7],[28,0,28,7],[29,0,29,7],[20,0,20,7],[21,0,21,7],[22,0,22,7],[23,0,23,7],[24,0,24,7],[25,0,25,7]]}
[]
["SME Status Notes"]
["1.  To be considered a SME, you must be engaged in economic activity:"]
["Economic Activity\nA legal entity is considered to be engaged in an economic activity, if it's involved in any form of trade or activity carried out for remuneration or financial interest in a given market. In general, any activity consisting in offering goods or services on a given market is considered as an 'economic activity'.\nThe following activities are not considered as economic activities:\n(1) activities for which there is no financial offset;\n(2) activities for which there is no given/direct market;\n(3) activities for which the income generated is not distinct from the personal\nincome of its members or shareholders\n"]
["2.  Headcount"]
["\nThe headcount is expressed in the number of annual work units (AWU), i.e. the number of persons who worked fulltime within a given enterprise (or on its behalf) during the entire year under consideration. The work of persons who have \n(i) not worked the full year \n(ii) worked part-time and \n(iii) the work of seasonal workers \nare counted as fractions of AWU. \nThe duration of maternity or parental leaves is not counted.\n"]
["The staff consists of:\n(a) employees;\n(b) persons working for the enterprise being subordinated to it and deemed to be employees under national law;\n(c) owner-managers;\n(d) partners engaging in a regular activity in the enterprise and benefiting from\nfinancial advantages from the enterprise.\n\nNote: Apprentices or students engaged in vocational training with an\napprenticeship or vocational training contract are not included as staff\n"]
["The headcount (Full Time Equivalents - FTEs) for a company are detailed in the accounts of a company filed with Companies House.  For the applicant a current count is required; for Linked and Partner enterprises the data in the last set of accounts can be used."]
["3. Thresholds"]
["Enterprise Category",null,"Headcount",null,"Annual Turnover",null,"Annual Balance Sheet Total"]
["Medium",null,"<250",null,"≤€  50M           or         ≤€  43M"]
["Small",null,"< 50",null,"≤€  10M           or         ≤€  10M"]
["Micro",null,"< 10",null,"≤€    2M           or         ≤€    2M"]
["HMRC's definition of a Micro-entity",null,"< 10",null,"≤£632K            or         ≤£316K"]
["FOR THE BASIS OF THIS SME STATUS CHECK, THE BALANCE SHEET TOTALS WILL BE USED (SEE BELOW).  SHOULD THE BALANCE SHEET GET WITHIN 5% OF THE THRESHOLD BETWEEN  SMALL-MEDIUM (WHERE THIS HAS AN IMPACT ON GRANT INTERVENTION RATE) OR WHERE IT NEARS/EXCEEDS THE MEDIUM THRESHOLD, YOU SHOULD CONTACT AEROSPACE CORNWALL"]
["4.  Balance Sheet total\n\n"]
["In the qualification conditions for small company and medium-sized company exemptions, the balance-sheet total is the total of fixed and current assets before deduction of current and long-term liabilities and can be found in the accounts filed with Companies House"]
["5.  Investors"]
["Investors can belong to one of the following categories:\n\na. Public investment corporations, venture capital companies, individuals or group of individuals with a regular venture capital investment activity who invest equity capital in unquoted businesses (\"business angels\"). Please note that the total investment of business angels in one enterprise cannot exceed EUR 1,250,000;\nb. Universities and non-profit research centres;\nc. Institutional investors, including regional development funds;\nd. Autonomous local authorities with an annual budget of less than EUR 10 million and less than 5000 inhabitant\n"]
["6.  Supporting Documents from Companies House"]
["6.1  Overview "]
["6.2  From the Filling History:"]
["6.2.1   Annual return and/or Confirmation Statement with updates and/or Change in PSC - this provides the shareholders information.  Note only voting shares count in the assessment."]
["6.2.2   Latest set of accounts"]
["6.3  From People"]
["6.3.1   Examine the shareholders who are directors listed here to determine other company relationships"]
["6.3.2   See  6.2.1"]
["6.4  Conduct a search for any other shareholder not listed in 6.3.1 to determine any other company relationships"]
["7.  New Enterprises"]
["If the company is newly established and does not have any closed accounts yet, then the status is based on the estimated figures taken from the first year's business plan (the turnover must be positive)."]

{"sheet":"SIC","index":4,"n_rows":804,"n_cols":4,"rows_kept":804,"cut":false,"hidden":true,"merged":[]}
["SIC Code","Sector","Activity Description"]
[1110,"A: agriculture, forestry & fishing","Growing of cereals (except rice), leguminous crops and oil seeds","AeroSpace Cornwall Team to verify eligibility"]
[1120,"A: agriculture, forestry & fishing","Growing of rice","AeroSpace Cornwall Team to verify eligibility"]
[1130,"A: agriculture, forestry & fishing","Growing of vegetables and melons, roots and tubers","AeroSpace Cornwall Team to verify eligibility"]
[1140,"A: agriculture, forestry & fishing","Growing of sugar cane","AeroSpace Cornwall Team to verify eligibility"]
[1150,"A: agriculture, forestry & fishing","Growing of tobacco","AeroSpace Cornwall Team to verify eligibility"]
[1160,"A: agriculture, forestry & fishing","Growing of fibre crops","AeroSpace Cornwall Team to verify eligibility"]
[1190,"A: agriculture, forestry & fishing","Growing of other non-perennial crops","AeroSpace Cornwall Team to verify eligibility"]
[1210,"A: agriculture, forestry & fishing","Growing of grapes","AeroSpace Cornwall Team to verify eligibility"]
[1220,"A: agriculture, forestry & fishing","Growing of tropical and subtropical fruits","AeroSpace Cornwall Team to verify eligibility"]
[1230,"A: agriculture, forestry & fishing","Growing of citrus fruits","AeroSpace Cornwall Team to verify eligibility"]
[1240,"A: agriculture, forestry & fishing","Growing of pome fruits and stone fruits","AeroSpace Cornwall Team to verify eligibility"]
[1250,"A: agriculture, forestry & fishing","Growing of other tree and bush fruits and nuts","AeroSpace Cornwall Team to verify eligibility"]
[1260,"A: agriculture, forestry & fishing","Growing of oleaginous fruits","AeroSpace Cornwall Team to verify eligibility"]
[1270,"A: agriculture, forestry & fishing","Growing of beverage crops","AeroSpace Cornwall Team to verify eligibility"]
[1280,"A: agriculture, forestry & fishing","Growing of spices, aromatic, drug and pharmaceutical crops","AeroSpace Cornwall Team to verify eligibility"]
[1290,"A: agriculture, forestry & fishing","Growing of other perennial crops","AeroSpace Cornwall Team to verify eligibility"]
[1300,"A: agriculture, forestry & fishing","Plant propagation","AeroSpace Cornwall Team to verify eligibility"]
[1410,"A: agriculture, forestry & fishing","Raising of dairy cattle","AeroSpace Cornwall Team to verify eligibility"]
[1420,"A: agriculture, forestry & fishing","Raising of other cattle and buffaloes","AeroSpace Cornwall Team to verify eligibility"]
[1430,"A: agriculture, forestry & fishing","Raising of horses and other equines","AeroSpace Cornwall Team to verify eligibility"]
[1440,"A: agriculture, forestry & fishing","Raising of camels and camelids","AeroSpace Cornwall Team to verify eligibility"]
[1450,"A: agriculture, forestry & fishing","Raising of sheep and goats","AeroSpace Cornwall Team to verify eligibility"]
[1460,"A: agriculture, forestry & fishing","Raising of swine/pigs","AeroSpace Cornwall Team to verify eligibility"]
[1470,"A: agriculture, forestry & fishing","Raising of poultry","AeroSpace Cornwall Team to verify eligibility"]
[1490,"A: agriculture, forestry & fishing","Raising of other animals","AeroSpace Cornwall Team to verify eligibility"]
[1500,"A: agriculture, forestry & fishing","Mixed farming","AeroSpace Cornwall Team to verify eligibility"]
[1610,"A: agriculture, forestry & fishing","Support activities for crop production","AeroSpace Cornwall Team to verify eligibility"]
[162,"A: agriculture, forestry & fishing","Support activities for animal production","AeroSpace Cornwall Team to verify eligibility"]
[1621,"A: agriculture, forestry & fishing","Farm animal boarding and care","AeroSpace Cornwall Team to verify eligibility"]
[1629,"A: agriculture, forestry & fishing","Support activities for animal production (other than farm animal boarding and care) nec","AeroSpace Cornwall Team to verify eligibility"]
[1630,"A: agriculture, forestry & fishing","Post-harvest crop activities","AeroSpace Cornwall Team to verify eligibility"]
[1640,"A: agriculture, forestry & fishing","Seed processing for propagation","AeroSpace Cornwall Team to verify eligibility"]
[1700,"A: agriculture, forestry & fishing","Hunting, trapping and related service activities","AeroSpace Cornwall Team to verify eligibility"]
[2100,"A: agriculture, forestry & fishing","Silviculture and other forestry activities","AeroSpace Cornwall Team to verify eligibility"]
[2200,"A: agriculture, forestry & fishing","Logging","AeroSpace Cornwall Team to verify eligibility"]
[2300,"A: agriculture, forestry & fishing","Gathering of wild growing non-wood products","AeroSpace Cornwall Team to verify eligibility"]
[2400,"A: agriculture, forestry & fishing","Support services to forestry","AeroSpace Cornwall Team to verify eligibility"]
[3110,"A: agriculture, forestry & fishing","Marine fishing","AeroSpace Cornwall Team to verify eligibility"]
[3120,"A: agriculture, forestry & fishing","Freshwater fishing","AeroSpace Cornwall Team to verify eligibility"]
{"$rows_left_out":765}
{"sheet":"Sheet1","index":5,"n_rows":381,"n_cols":1,"rows_kept":381,"cut":false,"hidden":true,"merged":[]}
["Please Select"]
["Previous AeroSpace Cornwall beneficiary"]
["Web Search"]
["SocialMedia"]
["Referral (please provide the name of the organisation in the \"Other\" response below"]
["Other (please provide details below)"]
[]
["Please Select"]
["A: Agriculture, forestry, fishing Aquaculture: contact the AeroSpace Cornwall Team before completing any further questions"]
["B: Mining & quarrying: proceed to the next question"]
["C: Manufacturing (but not synthetics,textiles and clothing): proceed to the next question"]
["D: Environmental/Renewable Technology/Low carbon: proceed to the next question"]
["E: Water; sewerage, waste & remediation: proceed to the next question"]
["F: construction(not house building): proceed to the next question"]
["G:Wholesale: proceed to the next question"]
["H: Distribution/logistics: proceed to the next question"]
["I: Food and Drink: proceed to the next question"]
["J: ICT/Creative media: proceed to the next question"]
["K:Business services: proceed to the next question"]
["L: Real estate: contact the AeroSpace Cornwall Team before completing any further questions"]
["M: Professional, scientific & technical: proceed to the next question"]
["N: Admin & support: proceed to the next question"]
["O: Public admin & defence: contact the AeroSpace Cornwall Team before completing any further questions"]
["P: Education: contact the AeroSpace Cornwall Team before completing any further questions"]
["Q:Medical/Biotech: proceed to the next question"]
["R: Tourism, arts, entertainment & recreation: contact the AeroSpace Cornwall Team before completing any further questions"]
["S: other service: contact the AeroSpace Cornwall Team before completing any further questions"]
["T:  households as employers etc: contact the AeroSpace Cornwall  Team before completing any further questions"]
["U: extraterritorial organisations & bodies: contact the AeroSpace Cornwall Team before completing any further questions"]
["V:Retail: contact the AeroSpace Cornwall Team before completing any further questions"]
["W:Other: contact the AeroSpace Cornwall Team before completing any further questions"]
[]
[]
[]
[]
[]
[]
[]
[]
[]
{"$rows_left_out":341}