{"text_format":"1","workbook":"xlsx","n_sheets":6,"sheets":["I&C","Summary","SoWR","Mech","OoH","Add"],"not_rendered":{"charts":0,"images":0,"macros":1,"external_links":2,"defined_names":24,"comments":0,"pivot_tables":0},"unopened":[],"bounds":{"document_bytes":16777216,"sheet_cells":100000,"rows_first":2000,"rows_last":500,"rows_between":2000,"halvings":0,"cell_chars":16384,"cell_head_chars":4096},"cells_cut":0,"cells_raw":0,"read":"whole","date_system":"1900"}

{"sheet":"I&C","index":0,"n_rows":23,"n_cols":1,"rows_kept":23,"cut":false,"hidden":false,"merged":[]}
["Next Page"]
["Grosvenor House Boiler Replacement"]
[]
["Instructions and Contents"]
[]
["Introduction"]
[{"$f":"IFERROR(IF(SoWR!$C$4<>\"\",CONCATENATE(\"This document forms the Pricing Schedule for Corby Borough Council’s \",('I&C'!$A$2),\" requirement and will be included as an appendix to the Contract between \",(SoWR!$C$4),\" and Corby Borough Council.\"),CONCATENATE(\"This document forms the Pricing Schedule for Corby Borough Council’s \",('I&C'!$A$2),\" requirement and will be included as an appendix to the Contract between The Supplier and Corby Borough Council.\")),\"\")","v":"This document forms the Pricing Schedule for Corby Borough Council’s Grosvenor House Boiler Replacement requirement and will be included as an appendix to the Contract between The Supplier and Corby Borough Council."}]
[]
["Instructions"]
[{"$f":"IFERROR(IF(SoWR!$C$4<>\"\",CONCATENATE(\"All areas which require \",(SoWR!$C$4),\" to provide information are clearly identified by a yellow highlight, as indicated below. Please note, the yellow highlight will disapear once data has been entered.\"),CONCATENATE(\"All areas which require The Supplier to provide information are clearly identified by a yellow highlight, as indicated below. Please note, the yellow highlight will disapear once data has been entered.\")),\"\")","v":"All areas which require The Supplier to provide information are clearly identified by a yellow highlight, as indicated below. Please note, the yellow highlight will disapear once data has been entered."}]
[]
[]
["You can move between the different pages of this document by clicking on text which is underlined in blue, as indicated in the example below."]
["Example Text"]
[]
["You can return to this Contents page at any time by clicking on the word Contents and to the next or previous page by clicking on the words Next Page or  Previous Page at the top of each page.\n\nWhere a section of underlined blue text references a specific page, as in the Contents list below (e.g. Pricing Summary), clicking on that text will take you directly to that page.\n\nPlease make sure to fill in all the relevant details and we look forward to receiving your submission."]
[]
["Contents (click the relevant word to go to that page)"]
["Pricing Summary"]
["Schedule of Works/Rates"]
{"$rows_left_out":4}
{"sheet":"Summary","index":1,"n_rows":39,"n_cols":4,"rows_kept":39,"cut":false,"hidden":false,"merged":[[1,0,1,3]]}
["Previous Page",null,"Contents","Next Page"]
[{"$f":"IFERROR(IF('I&C'!$A$2<>\"\",('I&C'!$A$2),\"\"),\"\")","v":"Grosvenor House Boiler Replacement"}]
[]
["Supplier:",null,{"$f":"IFERROR(IF(SoWR!$C$4<>\"\",(SoWR!$C$4),\"\"),\"\")","v":""}]
["Sub-Heading:",null,"Pricing Summary Total carried to Evaluation"]
["Pricing Summary"]
[]
[null,null,"Summary Section Headings","Section Costs"]
[null,"Summary Total carried to Evaluation",null,{"$f":"IFERROR(IF(OR(D10<>\"\",D11<>\"\",D12<>\"\",D13<>\"\"),SUM(D10,D11,D12:D13),\"\"),\"\")","v":5000}]
[null,1,"Schedule of Works/Rates",{"$f":"IFERROR(IF(D16<>\"\",SUM(D16),\"\"),\"\")","v":5000}]
[null,2,"Analysis of Tender: Mechanical",{"$f":"IFERROR(IF(OR(Mech!F19<>\"\"),SUM(Mech!F19),\"\"),\"\")","v":""}]
[null,3,"Out-of-Hours Rates",{"$f":"IFERROR(IF(OoH!F172<>\"\",SUM(OoH!F172),\"\"),\"\")","v":""}]
[null,4,"Additional Costs Not Otherwise Specified",{"$f":"IFERROR(IF(Add!I13<>\"\",SUM(Add!I13),\"\"),\"\")","v":""}]
[]
[null,null,"Summary Section Detail","Option Costs"]
[null,"Summary Total carried to Evaluation",null,{"$f":"IFERROR(IF(OR(D17<>\"\",D18<>\"\",D19<>\"\",D20<>\"\",D21<>\"\",D22<>\"\",D23<>\"\",D24<>\"\",D25<>\"\",D26<>\"\",D27<>\"\",D28<>\"\",D29<>\"\",D30<>\"\",D31<>\"\",D32<>\"\",D33<>\"\",D34<>\"\",D35<>\"\",D36<>\"\",D37<>\"\",D38<>\"\",D39<>\"\"),SUM(D17:D39),\"\"),\"\")","v":5000}]
[null,"1.1.1.",{"$f":"IFERROR(IF(B17<>\"\",VLOOKUP(B17,SoWR!$B$10:$F$72,2,0),\"\"),\"\")","v":"For all specified surveys including asbestos refurbishment and CCTV flue inspections, testing and reports, removal of\nall obsolete services and notices and temporary provisions including lockable skips (if required)."},{"$f":"IFERROR(IF(B17<>\"\",VLOOKUP(B17,SoWR!$B$10:$F$72,5,0),\"\"),\"\")","v":""}]
[null,"1.2.1.",{"$f":"IFERROR(IF(B18<>\"\",VLOOKUP(B18,SoWR!$B$10:$F$72,2,0),\"\"),\"\")","v":"New LPHW gas fired boiler plant and new flues to existing shaft as specified including two new boilers, two new flue\nliners and terminals, plus new invertor single head pump sets for each circuit and new sealed system F&E, PLUS new\nduty/standby sump pumps as specified or equal and approved equivalent."},{"$f":"IFERROR(IF(B18<>\"\",VLOOKUP(B18,SoWR!$B$10:$F$72,5,0),\"\"),\"\")","v":""}]
[null,"1.3.1.",{"$f":"IFERROR(IF(B19<>\"\",VLOOKUP(B19,SoWR!$B$10:$F$72,2,0),\"\"),\"\")","v":"Extending existing gas supplies with new pipework to serve new boilers including utilising existing safety shut-off\nvalve (allowance for new gas valve to be included and saving option to be offered to client, subject to satisfactory\nsurvey/testing etc)."},{"$f":"IFERROR(IF(B19<>\"\",VLOOKUP(B19,SoWR!$B$10:$F$72,5,0),\"\"),\"\")","v":""}]
[null,"1.3.2.",{"$f":"IFERROR(IF(B20<>\"\",VLOOKUP(B20,SoWR!$B$10:$F$72,2,0),\"\"),\"\")","v":"Modify existing LPHW mains, headers and distributing pipework within boiler houses including new Spirocross low\nloss air/dirt separators, new X-Pot c/w auto-controls and connections to existing distribution system retained/reused\nwith new valves on existing mains within boiler room."},{"$f":"IFERROR(IF(B20<>\"\",VLOOKUP(B20,SoWR!$B$10:$F$72,5,0),\"\"),\"\")","v":""}]
{"$rows_left_out":20}
{"sheet":"SoWR","index":2,"n_rows":71,"n_cols":6,"rows_kept":71,"cut":false,"hidden":false,"merged":[[7,0,7,5],[9,1,9,2],[14,1,14,2],[1,0,1,5],[5,0,5,5],[4,2,4,5],[52,1,52,2],[59,1,59,2],[67,1,67,2],[19,1,19,2],[26,1,26,2],[31,1,31,2],[38,1,38,2],[43,1,43,2]]}
["Previous Page",null,"Contents","Next Page"]
[{"$f":"IFERROR(IF('I&C'!$A$2<>\"\",('I&C'!$A$2),\"\"),\"\")","v":"Grosvenor House Boiler Replacement"}]
[]
["Supplier:"]
["Sub-Heading:",null,"Schedule of Works/Rates"]
["Pricing Schedule"]
[]
["For the complete supply and installation, testing, commissioning and setting to work, as indicated and specified."]
[]
[null,"Item",null,"Quantity Required","Cost Each (£ p)","Cost for\nQty Required"]
[null,"1.1.","Inspections, Reports, Removal and Temporary Works"]
[null,"Sub-Total carried to Summary",null,{"$f":"IFERROR(IF(OR(D13<>\"\"),SUM(D13:D13),\"\"),\"\")","v":1},{"$f":"IFERROR(IF(OR(E13<>\"\"),SUM(E13:E13),\"\"),\"\")","v":""},{"$f":"IFERROR(IF(OR(F13<>\"\"),SUM(F13:F13),\"\"),\"\")","v":""}]
[null,"1.1.1.","For all specified surveys including asbestos refurbishment and CCTV flue inspections, testing and reports, removal of\nall obsolete services and notices and temporary provisions including lockable skips (if required).",1,null,{"$f":"IFERROR(IF(AND(D13<>\"\",E13<>\"\"),SUM(D13*E13),\"\"),\"\")","v":""}]
[]
[null,"Item",null,"Quantity Required","Cost Each (£ p)","Cost for\nQty Required"]
[null,"1.2.","New Main Plant"]
[null,"Sub-Total carried to Summary",null,{"$f":"IFERROR(IF(OR(D18<>\"\"),SUM(D18:D18),\"\"),\"\")","v":1},{"$f":"IFERROR(IF(OR(E18<>\"\"),SUM(E18:E18),\"\"),\"\")","v":""},{"$f":"IFERROR(IF(OR(F18<>\"\"),SUM(F18:F18),\"\"),\"\")","v":""}]
[null,"1.2.1.","New LPHW gas fired boiler plant and new flues to existing shaft as specified including two new boilers, two new flue\nliners and terminals, plus new invertor single head pump sets for each circuit and new sealed system F&E, PLUS new\nduty/standby sump pumps as specified or equal and approved equivalent.",1,null,{"$f":"IFERROR(IF(AND(D18<>\"\",E18<>\"\"),SUM(D18*E18),\"\"),\"\")","v":""}]
[]
[null,"Item",null,"Quantity Required","Cost Each (£ p)","Cost for\nQty Required"]
{"$rows_left_out":52}
{"sheet":"Mech","index":3,"n_rows":19,"n_cols":6,"rows_kept":19,"cut":false,"hidden":false,"merged":[[17,1,17,4],[1,0,1,5],[11,1,11,2],[7,1,7,2]]}
["Previous Page",null,"Contents",null,"Next Page"]
[{"$f":"IFERROR(IF('I&C'!$A$2<>\"\",('I&C'!$A$2),\"\"),\"\")","v":"Grosvenor House Boiler Replacement"}]
[]
["Supplier:",null,{"$f":"IFERROR(IF(SoWR!$C$4<>\"\",(SoWR!$C$4),\"\"),\"\")","v":""}]
["Sub-Heading:",null,"Analysis of Tender: Mechanical"]
["Pricing Schedule"]
[]
[null,"Schedule of Day Work Rates\n(Normal Working Hours)",null,"Hours Per Week","Cost Per Hour","Sub-Total"]
[null,{"$f":"IFERROR(IF(C9<>\"\",SUBTOTAL(103,$C$9:$C9),\"\"),\"\")","v":1},"Operative",null,null,{"$f":"IFERROR(IF(AND(D9<>\"\",E9<>\"\"),SUM(D9*E9),\"\"),\"\")","v":""}]
[null,"Sub-Total for information only",null,{"$f":"IFERROR(IF(OR(D9<>\"\"),SUM(D9:D9),\"\"),\"\")","v":""},{"$f":"IFERROR(IF(OR(E9<>\"\"),SUM(E9:E9),\"\"),\"\")","v":""},{"$f":"IFERROR(IF(OR(F9<>\"\"),SUM(F9:F9),\"\"),\"\")","v":""}]
[]
[null,"Schedule of Day Work Rates\n(% Addition)",null,"Value Excl. Mechanical","Percentage Addition","Cost of % Addition"]
[null,{"$f":"IFERROR(IF(C13<>\"\",SUBTOTAL(103,$C$13:$C13),\"\"),\"\")","v":1},"Labour",{"$f":"IFERROR(IF(OR(Summary!D10<>\"\",Summary!D12<>\"\",Summary!D13<>\"\"),SUM(Summary!D10,Summary!D12,Summary!D13),\"\"),\"\")","v":5000},null,{"$f":"IFERROR(IF(AND(D13<>\"\",E13<>\"\"),SUM(SUM(D13/E13)),\"\"),\"\")","v":""}]
[null,{"$f":"IFERROR(IF(C14<>\"\",SUBTOTAL(103,$C$13:$C14),\"\"),\"\")","v":2},"Material",{"$f":"IFERROR(IF(OR(Summary!D10<>\"\",Summary!D12<>\"\",Summary!D13<>\"\"),SUM(Summary!D10,Summary!D12,Summary!D13),\"\"),\"\")","v":5000},null,{"$f":"IFERROR(IF(AND(D14<>\"\",E14<>\"\"),SUM(SUM(D14/E14)),\"\"),\"\")","v":""}]
[null,{"$f":"IFERROR(IF(C15<>\"\",SUBTOTAL(103,$C$13:$C15),\"\"),\"\")","v":3},"Plant",{"$f":"IFERROR(IF(OR(Summary!D10<>\"\",Summary!D12<>\"\",Summary!D13<>\"\"),SUM(Summary!D10,Summary!D12,Summary!D13),\"\"),\"\")","v":5000},null,""]
[null,"Sub-Total carried to Summary",null,{"$f":"IFERROR(IF(OR(D13<>\"\",D14<>\"\",D15<>\"\"),SUM(D13),\"\"),\"\")","v":5000},{"$f":"IFERROR(IF(OR(E13<>\"\",E14<>\"\",E15<>\"\"),SUM(E13:E15),\"\"),\"\")","v":""},{"$f":"IFERROR(IF(OR(F13<>\"\",F14<>\"\",F15<>\"\"),SUM(F13:F15),\"\"),\"\")","v":""}]
[]
[null,"Schedule of Day Work Rates",null,null,null,"Total"]
[null,"Page Total of Mechanical carried to Summary",null,null,null,{"$f":"IFERROR(IF(OR(F16<>\"\"),SUM(F16),\"\"),\"\")","v":""}]

{"sheet":"OoH","index":4,"n_rows":172,"n_cols":6,"rows_kept":172,"cut":false,"hidden":false,"merged":[[7,1,7,2],[60,1,60,2],[115,1,115,2],[170,1,170,2],[1,0,1,5]]}
["Previous Page",null,"Contents","Next Page"]
[{"$f":"IFERROR(IF('I&C'!$A$2<>\"\",('I&C'!$A$2),\"\"),\"\")","v":"Grosvenor House Boiler Replacement"}]
[]
["Supplier:",null,{"$f":"IFERROR(IF(SoWR!$C$4<>\"\",(SoWR!$C$4),\"\"),\"\")","v":""}]
["Sub-Heading:",null,"Schedule of Out-of-Hours Rates"]
["Pricing Schedule"]
[]
[null,"Out-of-Hours\n(Monday to Friday, 17:00 - 08:59)",null,"Time Required","Cost Per Hour","Cost for\nQty Required"]
[null,"Sub-Total carried to Summary",null,{"$f":"IFERROR(IF(OR(D10<>\"\",D11<>\"\",D12<>\"\",D13<>\"\",D14<>\"\",D15<>\"\",D16<>\"\",D17<>\"\",D18<>\"\",D19<>\"\",D20<>\"\",D21<>\"\",D22<>\"\",D23<>\"\",D24<>\"\",D25<>\"\",D26<>\"\",D27<>\"\",D28<>\"\",D29<>\"\",D30<>\"\",D31<>\"\",D32<>\"\",D33<>\"\",D34<>\"\",D35<>\"\",D36<>\"\",D37<>\"\",D38<>\"\",D39<>\"\",D40<>\"\",D41<>\"\",D42<>\"\",D43<>\"\",D44<>\"\",D45<>\"\",D46<>\"\",D47<>\"\",D48<>\"\",D49<>\"\",D50<>\"\",D51<>\"\",D52<>\"\",D53<>\"\",D54<>\"\",D55<>\"\",D56<>\"\",D57<>\"\",D58<>\"\",D59<>\"\",#REF!<>\"\"),SUM(D10:D59),\"\"),\"\")","v":""},{"$f":"IFERROR(IF(OR(E10<>\"\",E11<>\"\",E12<>\"\",E13<>\"\",E14<>\"\",E15<>\"\",E16<>\"\",E17<>\"\",E18<>\"\",E19<>\"\",E20<>\"\",E21<>\"\",E22<>\"\",E23<>\"\",E24<>\"\",E25<>\"\",E26<>\"\",E27<>\"\",E28<>\"\",E29<>\"\",E30<>\"\",E31<>\"\",E32<>\"\",E33<>\"\",E34<>\"\",E35<>\"\",E36<>\"\",E37<>\"\",E38<>\"\",E39<>\"\",E40<>\"\",E41<>\"\",E42<>\"\",E43<>\"\",E44<>\"\",E45<>\"\",E46<>\"\",E47<>\"\",E48<>\"\",E49<>\"\",E50<>\"\",E51<>\"\",E52<>\"\",E53<>\"\",E54<>\"\",E55<>\"\",E56<>\"\",E57<>\"\",E58<>\"\",E59<>\"\",#REF!<>\"\"),SUM(E10:E59),\"\"),\"\")","v":""},{"$f":"IFERROR(IF(OR(F10<>\"\",F11<>\"\",F12<>\"\",F13<>\"\",F14<>\"\",F15<>\"\",F16<>\"\",F17<>\"\",F18<>\"\",F19<>\"\",F20<>\"\",F21<>\"\",F22<>\"\",F23<>\"\",F24<>\"\",F25<>\"\",F26<>\"\",F27<>\"\",F28<>\"\",F29<>\"\",F30<>\"\",F31<>\"\",F32<>\"\",F33<>\"\",F34<>\"\",F35<>\"\",F36<>\"\",F37<>\"\",F38<>\"\",F39<>\"\",F40<>\"\",F41<>\"\",F42<>\"\",F43<>\"\",F44<>\"\",F45<>\"\",F46<>\"\",F47<>\"\",F48<>\"\",F49<>\"\",F50<>\"\",F51<>\"\",F52<>\"\",F53<>\"\",F54<>\"\",F55<>\"\",F56<>\"\",F57<>\"\",F58<>\"\",F59<>\"\"),SUM(F10:F59),\"\"),\"\")","v":""}]
[null,{"$f":"IFERROR(IF(C10<>\"\",SUBTOTAL(103,$C$10:C10),\"\"),\"\")","v":""},null,null,null,{"$f":"IFERROR(IF(AND(D10<>\"\",E10<>\"\"),SUM(D10*E10),\"\"),\"\")","v":""}]
[null,{"$f":"IFERROR(IF(C11<>\"\",SUBTOTAL(103,$C$10:C11),\"\"),\"\")","v":""},null,null,null,{"$f":"IFERROR(IF(AND(D11<>\"\",E11<>\"\"),SUM(D11*E11),\"\"),\"\")","v":""}]
[null,{"$f":"IFERROR(IF(C12<>\"\",SUBTOTAL(103,$C$10:C12),\"\"),\"\")","v":""},null,null,null,""]
[null,{"$f":"IFERROR(IF(C13<>\"\",SUBTOTAL(103,$C$10:C13),\"\"),\"\")","v":""},null,null,null,""]
[null,{"$f":"IFERROR(IF(C14<>\"\",SUBTOTAL(103,$C$10:C14),\"\"),\"\")","v":""},null,null,null,""]
[null,{"$f":"IFERROR(IF(C15<>\"\",SUBTOTAL(103,$C$10:C15),\"\"),\"\")","v":""},null,null,null,""]
[null,{"$f":"IFERROR(IF(C16<>\"\",SUBTOTAL(103,$C$10:C16),\"\"),\"\")","v":""},null,null,null,""]
[null,{"$f":"IFERROR(IF(C17<>\"\",SUBTOTAL(103,$C$10:C17),\"\"),\"\")","v":""},null,null,null,""]
[null,{"$f":"IFERROR(IF(C18<>\"\",SUBTOTAL(103,$C$10:C18),\"\"),\"\")","v":""},null,null,null,""]
[null,{"$f":"IFERROR(IF(C19<>\"\",SUBTOTAL(103,$C$10:C19),\"\"),\"\")","v":""},null,null,null,""]
[null,{"$f":"IFERROR(IF(C20<>\"\",SUBTOTAL(103,$C$10:C20),\"\"),\"\")","v":""},null,null,null,""]
{"$rows_left_out":153}
{"sheet":"Add","index":5,"n_rows":76,"n_cols":9,"rows_kept":76,"cut":false,"hidden":false,"merged":[[73,2,73,4],[73,5,73,6],[74,2,74,4],[74,5,74,6],[75,2,75,4],[75,5,75,6],[70,2,70,4],[70,5,70,6],[71,2,71,4],[71,5,71,6],[72,2,72,4],[72,5,72,6],[67,2,67,4],[67,5,67,6],[68,2,68,4],[68,5,68,6],[69,2,69,4],[69,5,69,6],[64,2,64,4],[64,5,64,6],[65,2,65,4],[65,5,65,6],[66,2,66,4],[66,5,66,6],[61,2,61,4],[61,5,61,6],[62,2,62,4],[62,5,62,6],[63,2,63,4],[63,5,63,6],[58,2,58,4],[58,5,58,6],[59,2,59,4],[59,5,59,6],[60,2,60,4],[60,5,60,6],[55,2,55,4],[55,5,55,6],[56,2,56,4],[56,5,56,6],[57,2,57,4],[57,5,57,6],[52,2,52,4],[52,5,52,6],[53,2,53,4],[53,5,53,6],[54,2,54,4],[54,5,54,6],[49,2,49,4],[49,5,49,6],[50,2,50,4],[50,5,50,6],[51,2,51,4],[51,5,51,6],[46,1,46,4],[46,5,46,6],[47,2,47,4],[47,5,47,6],[48,2,48,4],[48,5,48,6],[43,2,43,4],[43,5,43,6],[44,2,44,4],[44,5,44,6],[45,2,45,4],[45,5,45,6],[40,2,40,4],[40,5,40,6],[41,2,41,4],[41,5,41,6],[42,2,42,4],[42,5,42,6],[37,2,37,4],[37,5,37,6],[38,2,38,4],[38,5,38,6],[39,2,39,4],[39,5,39,6],[34,2,34,4],[34,5,34,6],[35,2,35,4],[35,5,35,6],[36,2,36,4],[36,5,36,6],[31,2,31,4],[31,5,31,6],[32,2,32,4],[32,5,32,6],[33,2,33,4],[33,5,33,6],[28,2,28,4],[28,5,28,6],[29,2,29,4],[29,5,29,6],[30,2,30,4],[30,5,30,6],[25,2,25,4],[25,5,25,6],[26,2,26,4],[26,5,26,6],[27,2,27,4],[27,5,27,6],[22,2,22,4],[22,5,22,6],[23,2,23,4],[23,5,23,6],[24,2,24,4],[24,5,24,6],[19,2,19,4],[19,5,19,6],[20,2,20,4],[20,5,20,6],[21,2,21,4],[21,5,21,6],[16,2,16,4],[16,5,16,6],[17,2,17,4],[17,5,17,6],[18,2,18,4],[18,5,18,6],[10,5,10,6],[11,5,11,6],[12,5,12,6],[14,1,14,4],[14,5,14,6],[15,2,15,4],[15,5,15,6],[1,0,1,8],[7,1,7,8],[9,1,9,7]]}
["Previous Page",null,"Contents"]
[{"$f":"IFERROR(IF('I&C'!$A$2<>\"\",('I&C'!$A$2),\"\"),\"\")","v":"Grosvenor House Boiler Replacement"}]
[]
["Supplier:",null,{"$f":"IFERROR(IF(SoWR!$C$4<>\"\",(SoWR!$C$4),\"\"),\"\")","v":""}]
["Sub-Heading:",null,"Additional Costs Not Otherwise Specified"]
["Pricing Schedule"]
[]
[null,{"$f":"IFERROR(IF(SoWR!$C$4<>\"\",CONCATENATE((SoWR!$C$4),\" is to detail, below, any and all additional items for which they require reimbursement. The items should be related to particular clause references and the costs idetified as ''Fixed'' or ''Time Related'' charges.\"&CHAR(10)&CHAR(10)&\" Items which are not included herein will not be paid by the Council.\"),CONCATENATE(\"The Supplier is to detail, below, any and all additional items for which they require reimbursement. The items should be related to particular clause references and the costs idetified as ''Fixed'' or ''Time Related'' charges.\"&CHAR(10)&CHAR(10)&\" Items which are not included herein will not be paid by the Council.\")),\"\")","v":"The Supplier is to detail, below, any and all additional items for which they require reimbursement. The items should be related to particular clause references and the costs idetified as ''Fixed'' or ''Time Related'' charges.\n\n Items which are not included herein will not be paid by the Council."}]
[]
[null,"Additional Costs Not Otherwise Specified",null,null,null,null,null,null,"Cost"]
[null,"Sub-Total (Fixed Charges)",null,null,null,null,null,null,{"$f":"IFERROR(IF(OR(I16<>\"\",I17<>\"\",I18<>\"\",I19<>\"\",I20<>\"\",I21<>\"\",I22<>\"\",I23<>\"\",I24<>\"\",I25<>\"\",I26<>\"\",I27<>\"\",I28<>\"\",I29<>\"\",I30<>\"\",I31<>\"\",I32<>\"\",I33<>\"\",I34<>\"\",I35<>\"\",I36<>\"\",I37<>\"\",I38<>\"\",I39<>\"\",I40<>\"\",I41<>\"\",I42<>\"\",I43<>\"\",I44<>\"\",I45<>\"\",I46<>\"\",I48<>\"\",I49<>\"\",I50<>\"\",I51<>\"\",I52<>\"\",I53<>\"\",I54<>\"\",I55<>\"\",I56<>\"\",I57<>\"\",I58<>\"\",I59<>\"\",I60<>\"\",I61<>\"\",I62<>\"\",I63<>\"\",I64<>\"\",I65<>\"\",I66<>\"\",I67<>\"\",I68<>\"\",I69<>\"\",I70<>\"\",I71<>\"\",I72<>\"\",I73<>\"\",I74<>\"\",I75<>\"\",I76<>\"\"),SUMIF(H16:H76,\"Fixed\",I16:I76),\"\"),\"\")","v":""}]
[null,"Sub-Total (Time Related Charges)",null,null,null,null,null,null,{"$f":"IFERROR(IF(OR(I16<>\"\",I17<>\"\",I18<>\"\",I19<>\"\",I20<>\"\",I21<>\"\",I22<>\"\",I23<>\"\",I24<>\"\",I25<>\"\",I26<>\"\",I27<>\"\",I28<>\"\",I29<>\"\",I30<>\"\",I31<>\"\",I32<>\"\",I33<>\"\",I34<>\"\",I35<>\"\",I36<>\"\",I37<>\"\",I38<>\"\",I39<>\"\",I40<>\"\",I41<>\"\",I42<>\"\",I43<>\"\",I44<>\"\",I45<>\"\",I46<>\"\",I48<>\"\",I49<>\"\",I50<>\"\",I51<>\"\",I52<>\"\",I53<>\"\",I54<>\"\",I55<>\"\",I56<>\"\",I57<>\"\",I58<>\"\",I59<>\"\",I60<>\"\",I61<>\"\",I62<>\"\",I63<>\"\",I64<>\"\",I65<>\"\",I66<>\"\",I67<>\"\",I68<>\"\",I69<>\"\",I70<>\"\",I71<>\"\",I72<>\"\",I73<>\"\",I74<>\"\",I75<>\"\",I76<>\"\"),SUMIF(H16:H76,\"Time Related\",I16:I76),\"\"),\"\")","v":""}]
[null,"Page Total of Additional Costs carried to Summary",null,null,null,null,null,null,{"$f":"IFERROR(IF(OR(I16<>\"\",I17<>\"\",I18<>\"\",I19<>\"\",I20<>\"\",I21<>\"\",I22<>\"\",I23<>\"\",I24<>\"\",I25<>\"\",I26<>\"\",I27<>\"\",I28<>\"\",I29<>\"\",I30<>\"\",I31<>\"\",I32<>\"\",I33<>\"\",I34<>\"\",I35<>\"\",I36<>\"\",I37<>\"\",I38<>\"\",I39<>\"\",I40<>\"\",I41<>\"\",I42<>\"\",I43<>\"\",I44<>\"\",I45<>\"\",I46<>\"\",I48<>\"\",I49<>\"\",I50<>\"\",I51<>\"\",I52<>\"\",I53<>\"\",I54<>\"\",I55<>\"\",I56<>\"\",I57<>\"\",I58<>\"\",I59<>\"\",I60<>\"\",I61<>\"\",I62<>\"\",I63<>\"\",I64<>\"\",I65<>\"\",I66<>\"\",I67<>\"\",I68<>\"\",I69<>\"\",I70<>\"\",I71<>\"\",I72<>\"\",I73<>\"\",I74<>\"\",I75<>\"\",I76<>\"\"),SUM(I16:I76),\"\"),\"\")","v":""}]
[]
[null,"Additional Item List",null,null,null,"Clause Ref:",null,"Fixed or\nTime Related","Cost"]
[null,{"$f":"IFERROR(IF(C16<>\"\",SUBTOTAL(103,$C$16:$C16),\"\"),\"\")","v":""}]
[null,{"$f":"IFERROR(IF(C17<>\"\",SUBTOTAL(103,$C$16:$C17),\"\"),\"\")","v":""}]
[null,{"$f":"IFERROR(IF(C18<>\"\",SUBTOTAL(103,$C$16:$C18),\"\"),\"\")","v":""}]
[null,{"$f":"IFERROR(IF(C19<>\"\",SUBTOTAL(103,$C$16:$C19),\"\"),\"\")","v":""}]
[null,{"$f":"IFERROR(IF(C20<>\"\",SUBTOTAL(103,$C$16:$C20),\"\"),\"\")","v":""}]
{"$rows_left_out":56}